program: Gaussian 09
title: 000289917
version: EM64L-G09RevD.01
frameworkgroup: C1[X(C12H23NO4)]
method: RPBEPBE
basis: SDD
operation: Freq
keyword: #p
keyword: freq=noraman
keyword: PBEPBE/SDD
title: #p freq=noraman PBEPBE/SDD
converged: YES YES NO NO
title: Mulliken charges:
elementType: O O O O N C C C C C C C C C C C C H H H H H H H H H H H H H H H H H H H H H H H
charge: -0.266713 -0.263536 -0.275339 -0.283839 -0.091725 -0.024798 -0.378806 -0.524224 -0.491833 -0.681385 -0.697849 0.307273 0.299083 -0.266157 -0.265670 -0.659988 -0.665589 0.199165 0.204126 0.219486 0.275368 0.243814 0.227481 0.274096 0.209046 0.223948 0.202845 0.205151 0.257215 0.199107 0.222064 0.232015 0.234910 0.218980 0.231407 0.248460 0.210382 0.227977 0.261464 0.202592
chargesum: 0.00000
title: Mulliken charges with hydrogens summed into heavy atoms:
elementType: O O O O N C C C C C C C C C C C C
charge: -0.266713 -0.263536 -0.275339 -0.283839 -0.091725 0.174366 0.044807 -0.005042 0.009744 -0.045546 -0.036377 0.307273 0.299083 0.187922 0.188220 0.030261 0.026444
polarizability: 1.76771523e+02 -5.02852036e+00 1.47836225e+02 -3.72583471e+00 -7.04845614e+00 1.28407841e+02
1716.lowfreq: -13.1822 -6.7648 0.0008 0.0009 0.0010 8.9077 19.7722 29.1436 31.4365
frequency: 17.8131 28.0549 31.0095 41.3124 49.9777 68.1390 81.9373 89.5629 93.3406 106.5282 126.9497 156.9296 176.4349 205.9302 211.7063 229.3839 250.4333 267.7621 273.2345 310.1084 322.2464 326.7883 347.9257 380.9334 409.7435 429.1158 437.5603 499.8039 533.6538 538.6570 550.1929 620.6853 648.8614 715.2659 767.9072 787.2288 819.9596 821.5153 842.4731 863.0891 870.6479 901.7111 919.2754 926.7816 962.7274 971.7755 1004.6382 1012.5511 1037.3063 1079.1920 1093.9120 1099.8426 1111.4775 1123.1786 1126.5805 1146.3994 1154.9773 1160.4998 1180.0795 1207.9805 1214.1547 1273.5049 1274.0854 1292.5993 1298.5509 1323.6823 1337.2640 1351.0336 1353.5750 1364.4197 1366.4660 1372.2743 1383.6613 1392.4445 1396.5941 1402.5719 1421.4973 1426.0691 1450.8570 1457.6922 1461.4731 1461.7568 1465.6052 1467.2353 1469.8224 1478.6793 1481.4792 1489.6557 1493.3963 1634.1261 1639.1192 2960.0158 2969.4608 2969.7174 2975.7226 2983.4308 2985.3746 2988.1939 2991.5530 3023.4062 3025.5278 3030.2805 3034.8869 3059.0681 3070.3774 3082.1930 3083.3725 3087.1939 3087.6855 3088.8301 3090.9395 3091.3118 3111.0934 3114.8755
redmass: 3.3826 2.8805 3.9684 5.1959 2.7909 3.6843 3.3612 3.3468 4.1365 5.3257 4.4105 2.9994 1.9018 1.4683 1.0645 1.5470 1.8277 2.3825 1.1817 2.0648 2.8860 3.1229 3.3299 2.8521 1.9698 2.9151 3.1223 2.8241 3.6542 2.5591 3.4427 4.0107 4.5866 3.0666 2.4120 1.8711 1.9517 1.5107 2.4642 3.3744 2.6599 1.2801 1.3837 2.2236 2.3072 2.3425 2.6137 2.8646 3.6570 1.8694 2.3306 2.1487 3.7883 2.2973 3.0364 2.1025 1.6603 1.7060 1.7435 1.3208 1.7180 1.1231 1.1283 1.4926 1.3781 1.6789 1.3004 1.3063 1.3333 1.2380 1.2174 1.4092 1.2209 1.2287 1.2254 1.4035 1.1316 1.1322 1.0903 1.0404 1.0735 1.0604 1.0554 1.0901 1.0510 1.0526 1.0524 1.0560 1.0535 8.6868 8.4096 1.0633 1.0513 1.0434 1.0380 1.0739 1.0775 1.0361 1.0361 1.0581 1.0591 1.1008 1.0970 1.0992 1.0983 1.1005 1.1017 1.1004 1.0988 1.1022 1.0939 1.0973 1.1051 1.1054
irintensity: 0.1629 0.4534 0.5461 2.9389 0.6806 0.5465 0.8313 2.5521 0.3411 5.8959 8.8083 1.3951 1.9665 6.6005 0.3966 1.3367 0.7005 4.5966 0.9534 2.6559 6.0985 17.5984 3.1036 1.4843 6.6695 5.6142 1.8316 14.9300 3.3491 11.6233 3.7373 2.7929 17.1162 2.2933 20.5091 7.8354 0.6153 5.1182 2.4946 5.4870 14.0088 1.2503 1.4758 4.0084 14.2665 35.8226 16.8917 103.8435 13.7360 88.5999 71.6558 27.6258 195.9767 11.2865 369.4571 3.7354 8.7632 34.0125 25.3035 25.3715 33.1883 2.7515 2.4604 24.4265 4.3523 87.0733 15.2214 9.8131 15.8274 32.2531 8.8889 1.3159 18.8048 18.3395 15.9864 18.1402 80.7385 1.7334 17.6625 21.5131 7.3087 2.5845 5.2869 11.3504 2.7818 13.3509 8.4012 10.3453 13.5547 14.4794 300.6140 35.3484 9.2804 36.7995 41.6948 57.0813 5.7691 21.5382 20.7015 42.2810 33.6306 22.5453 12.4685 8.7261 99.4121 30.6270 15.2295 12.5820 34.9280 6.4759 12.0056 20.1541 37.2944 33.8588
temp: 298.150 k
press: 1.00000 atm
elementType: 8 8 8 8 7 6 6 6 6 6 6 6 6 6 6 6 6 1 1 1 1 1 1 1 1 1 1 1 1 1 1 1 1 1 1 1 1 1 1 1
symmnumber: 1
zpe: 892244.0 jmol-1
zpe.correction: 0.339838 hartree
zpe.thermalcorrener: 0.361001 hartree
zpe.thermalcorrenthalpy: 0.361945 hartree
zpe.thermalcorrgfe: 0.287210 hartree
zpe.sumelectzpe: -825.331119 hartree
zpe.sumelectthermal: -825.309956 hartree
zpe.sumelectthermalent: -825.309012 hartree
zpe.sumelectthermalfe: -825.383747 hartree
dipole: -0.5596 0.4488 0.5330
dipole: 0.8936
quadrupole: -90.5729 -97.4866 -108.8326
quadrupole: -2.9343 -2.0299 2.4112
quadrupole: 8.3911 1.4774 -9.8686 -2.9343 -2.0299 2.4112
hfenergy: -825.6709568 hartree
pointgroup: C01 [X(C12H23N1O4)]
dipole: 0.1535903 0.248393 0.1957458 debye
polarizability: 144.0704856|-1.3500064|177.253627|-10.4263961|3.945187|131.6914757 unknown
InChI: InChI=1S/C12H23NO4/c1-5-16-11(14)7-8-13(10(3)4)9-12(15)17-6-2/h10H,5-9H2,1-4H3
charge 0 multiplicity 1
40 atoms
O  2.331528 1.392064 -0.8743
O  -2.734113 0.729285 0.524266
O  0.833844 0.613557 0.741085
O  -1.510518 0.766171 -1.465495
N  0.587212 -1.883292 -0.853969
C  1.302622 -2.799742 0.064276
C  -0.830951 -2.076852 -1.157809
C  1.281289 -0.712605 -1.3447
C  -1.867427 -1.360872 -0.241369
C  1.444726 -4.226322 -0.53173
C  0.701093 -2.859367 1.494749
C  1.422394 0.465554 -0.354607
C  -1.982476 0.133314 -0.489526
C  2.495598 2.679875 -0.132617
C  -2.853775 2.219609 0.513737
C  1.528888 3.728649 -0.690282
C  -1.931455 2.798921 1.590427
H  2.324745 -2.380535 0.160037
H  -1.051026 -3.161112 -1.116537
H  -1.021974 -1.75523 -2.20134
H  0.743323 -0.295614 -2.217601
H  2.306356 -0.957827 -1.691315
H  -2.872577 -1.800938 -0.410743
H  -1.631743 -1.51309 0.824027
H  2.050086 -4.869246 0.134568
H  1.930525 -4.187293 -1.52283
H  0.457684 -4.711243 -0.651748
H  1.359121 -3.444704 2.164408
H  0.586899 -1.841604 1.905686
H  -0.287892 -3.35612 1.488775
H  3.548999 2.955203 -0.303062
H  2.319633 2.492046 0.941408
H  -2.59506 2.585042 -0.495644
H  -3.917626 2.417615 0.72633
H  1.693755 3.878951 -1.7709
H  0.481697 3.416126 -0.538325
H  1.684062 4.695412 -0.175667
H  -2.210108 2.42221 2.58963
H  -0.88338 2.513035 1.397101
H  -2.009476 3.902571 1.59951
