program: Gaussian 09
title: 000289916
version: EM64L-G09RevD.01
frameworkgroup: C1[X(C13H25NO4)]
method: RPBEPBE
basis: SDD
operation: Freq
keyword: #p
keyword: freq=noraman
keyword: PBEPBE/SDD
title: #p freq=noraman PBEPBE/SDD
converged: YES YES NO NO
title: Mulliken charges:
elementType: O O O O N C C C C C C C C C C C C C H H H H H H H H H H H H H H H H H H H H H H H H H
charge: -0.265810 -0.267011 -0.252942 -0.250744 -0.125713 -0.033564 -0.355412 -0.363414 -0.691817 -0.695818 -0.510448 -0.507789 0.257880 0.258214 -0.264576 -0.263876 -0.664307 -0.664680 0.196277 0.233698 0.204112 0.235438 0.204369 0.210977 0.229021 0.206674 0.220727 0.217087 0.215190 0.242729 0.253088 0.253939 0.239825 0.232889 0.222611 0.222748 0.233979 0.228008 0.249747 0.215666 0.248636 0.227396 0.216998
chargesum: 0.00000
title: Mulliken charges with hydrogens summed into heavy atoms:
elementType: O O O O N C C C C C C C C C C C C C
charge: -0.265810 -0.267011 -0.252942 -0.250744 -0.125713 0.162713 0.082397 0.076394 -0.045146 -0.042813 -0.014631 -0.014026 0.257880 0.258214 0.190923 0.192851 0.029114 0.028350
polarizability: 1.92970390e+02 1.04787565e+00 1.69965961e+02 -4.12007628e+00 -2.02309412e+00 1.30275165e+02
1716.lowfreq: -17.2242 -16.0371 -3.2229 -0.0011 -0.0007 -0.0007 2.1973 10.2523 17.4093
frequency: -16.0894 -12.8230 17.3852 29.3852 41.3621 50.6171 66.5674 67.5857 71.0478 82.8653 101.5081 131.2317 151.8002 171.3193 187.6958 198.6863 213.9233 219.5518 222.4023 253.9769 273.2417 301.3245 314.5290 341.5245 362.2535 387.3215 417.3603 439.4409 467.6253 475.7406 540.4574 574.3807 588.6548 651.0592 671.6375 733.6556 769.5610 778.1298 787.5584 801.6187 816.2482 818.9781 869.5010 901.0795 904.1478 906.8236 930.6444 977.5850 1008.5370 1011.8875 1027.2295 1047.9018 1063.9969 1088.5909 1089.8865 1095.9116 1097.5769 1124.6463 1129.1046 1145.1472 1155.3834 1155.9073 1159.9348 1170.6397 1210.7197 1222.9927 1274.5072 1277.3453 1277.8853 1294.1442 1302.4854 1307.7533 1313.3242 1353.9374 1354.9247 1368.8602 1369.5191 1375.0763 1381.8096 1388.6744 1390.2794 1391.8720 1442.3489 1445.2725 1455.5384 1456.3846 1459.0066 1461.9918 1462.5691 1465.0050 1474.2712 1480.0612 1481.0520 1484.2408 1484.8755 1486.7085 1634.1829 1635.7699 2890.3944 2898.4061 2975.2180 2981.7105 2989.4919 2992.4647 2992.7381 3000.6905 3002.3211 3027.5643 3028.8462 3052.9061 3061.1537 3068.9537 3071.0989 3076.8625 3080.2164 3082.9674 3087.6096 3088.0297 3091.1340 3092.1714 3092.4970 3118.4325 3118.5693
redmass: 3.8346 4.0936 4.1612 3.2905 3.1767 3.6763 4.0084 2.4825 3.0680 3.2667 2.7306 2.7396 2.7805 2.7122 1.1591 2.9874 1.3094 1.3950 1.0940 2.5976 2.1340 2.5834 2.8736 3.8132 3.0198 2.9024 3.1148 3.0090 3.0025 3.2594 2.6029 3.2249 3.2316 4.1362 3.7017 2.8835 1.5109 1.4637 1.7186 1.5940 1.7527 2.0031 2.6907 3.2403 2.9521 1.3661 1.3771 2.3611 2.7996 2.7912 2.5497 2.2687 3.1535 2.3402 2.3285 2.1747 2.1327 2.3034 2.5386 2.6842 1.6883 1.6829 1.8706 1.5829 1.8488 1.7674 1.2276 1.1183 1.1196 1.1990 1.5852 1.4014 1.4038 1.2804 1.2901 1.2605 1.3529 1.3341 1.3890 1.2325 1.2342 1.2390 1.0885 1.0829 1.0935 1.0921 1.0587 1.0433 1.0445 1.0558 1.0622 1.0680 1.0670 1.0512 1.0506 1.0573 8.9030 8.9142 1.0716 1.0717 1.0350 1.0358 1.0842 1.0360 1.0359 1.0631 1.0633 1.0595 1.0594 1.0885 1.0899 1.0992 1.0995 1.0985 1.0970 1.0949 1.0973 1.0975 1.0998 1.1031 1.1033 1.1061 1.1058
irintensity: 1.3533 0.5622 0.5387 0.0294 0.0908 0.6736 1.2484 0.4167 0.9284 0.8052 1.0008 3.8470 3.9579 1.2969 0.6736 1.2870 4.2443 2.2316 0.2692 3.1054 5.3052 10.1805 17.8846 7.2481 3.4905 1.9118 2.7657 2.0147 2.9142 14.8614 6.6552 4.3158 6.5439 5.8016 13.8589 3.1873 11.8372 5.9656 8.8184 7.1895 3.5505 3.3792 7.1757 26.4749 15.0915 5.1251 0.1451 20.2905 28.1808 74.7535 107.9001 5.6738 22.8267 47.4857 126.4963 7.5587 8.5532 67.2335 113.2634 287.9707 34.1195 21.9148 26.1695 69.7079 13.3863 38.8973 28.9424 3.2652 3.7474 7.0200 86.4826 25.6215 36.2844 0.6401 0.8805 27.2450 45.4247 18.7809 10.9934 23.5627 26.5862 25.0314 19.2068 13.7511 14.1605 12.0562 0.2686 14.4662 13.9058 1.1988 4.3081 19.3450 13.4245 13.7686 13.4355 10.0896 132.8035 158.6650 32.0351 92.7550 28.6205 25.3677 21.1758 20.2412 19.3044 8.1744 11.8437 34.3313 31.1881 4.8971 2.5111 4.2705 37.2769 27.8203 78.0221 27.6422 41.1517 34.3911 36.1099 0.6502 0.3939 33.6720 34.2829
temp: 298.150 k
press: 1.00000 atm
elementType: 8 8 8 8 7 6 6 6 6 6 6 6 6 6 6 6 6 6 1 1 1 1 1 1 1 1 1 1 1 1 1 1 1 1 1 1 1 1 1 1 1 1 1
symmnumber: 1
zpe: 964675.3 jmol-1
zpe.correction: 0.367425 hartree
zpe.thermalcorrener: 0.388501 hartree
zpe.thermalcorrenthalpy: 0.389446 hartree
zpe.thermalcorrgfe: 0.314778 hartree
zpe.sumelectzpe: -864.555529 hartree
zpe.sumelectthermal: -864.534453 hartree
zpe.sumelectthermalent: -864.533509 hartree
zpe.sumelectthermalfe: -864.608176 hartree
dipole: 1.4852 -0.4105 -0.4854
dipole: 1.6156
quadrupole: -95.5708 -106.9087 -111.5953
quadrupole: 8.2116 -0.5818 3.1270
quadrupole: 9.1209 -2.2171 -6.9037 8.2116 -0.5818 3.1270
hfenergy: -864.9229541 hartree
pointgroup: C01 [X(C13H25N1O4)]
dipole: -0.5890631 0.1387227 -0.1943692 debye
polarizability: 193.156273|1.3503886|169.7972341|2.2140321|-3.2329158|130.2580087 unknown
InChI: InChI=1S/C13H25NO4/c1-5-17-12(15)7-9-14(11(3)4)10-8-13(16)18-6-2/h11H,5-10H2,1-4H3
charge 0 multiplicity 1
43 atoms
O  3.588911 1.721246 -1.057854
O  -4.538322 0.418753 -0.285015
O  4.206229 -0.410205 -0.333875
O  -2.903939 1.763902 0.70012
N  -0.020549 -1.412612 -0.08413
C  -0.333754 -2.85223 0.195693
C  1.386295 -1.016273 0.161575
C  -1.012118 -0.466695 0.480818
C  0.290931 -3.775257 -0.873103
C  0.044132 -3.314069 1.63239
C  1.833069 0.099153 -0.810091
C  -2.265634 -0.348655 -0.416582
C  3.316937 0.400056 -0.689391
C  -3.220859 0.72608 0.071136
C  5.024773 2.145052 -1.019171
C  -5.582076 1.432305 0.069008
C  5.410583 2.621043 0.38417
C  -5.69145 2.502199 -1.021008
H  -1.434271 -2.938424 0.095422
H  2.043441 -1.88704 -0.000117
H  1.559934 -0.681799 1.211901
H  -0.555393 0.534954 0.560309
H  -1.323963 -0.744703 1.515707
H  1.39587 -3.76004 -0.832863
H  -0.020591 -3.455391 -1.882514
H  -0.031212 -4.821226 -0.715512
H  1.140664 -3.32505 1.772025
H  -0.394373 -2.649938 2.400382
H  -0.328573 -4.33801 1.819424
H  1.262743 1.033323 -0.66874
H  1.629511 -0.242432 -1.844107
H  -1.93455 -0.081558 -1.439364
H  -2.810572 -1.303948 -0.503016
H  5.651039 1.293944 -1.340127
H  5.074044 2.957816 -1.761361
H  -6.503138 0.834089 0.156344
H  -5.320723 1.87848 1.044752
H  4.738128 3.427114 0.725112
H  5.365981 1.787569 1.104903
H  6.444344 3.014038 0.37447
H  -4.763758 3.095614 -1.082101
H  -5.88931 2.043184 -2.005041
H  -6.525128 3.189941 -0.78638
