program: Gaussian 09
title: 000289915
version: EM64L-G09RevD.01
frameworkgroup: C1[X(C10H9NO4S)]
method: RPBEPBE
basis: SDD
operation: Freq
keyword: #p
keyword: freq=noraman
keyword: PBEPBE/SDD
title: #p freq=noraman PBEPBE/SDD
converged: YES YES NO NO
title: Mulliken charges:
elementType: S O O O O N C C C C C C C C C C H H H H H H H H H
charge: 0.168225 -0.294364 -0.237919 -0.197698 -0.198788 0.028160 0.043824 -0.671071 -0.666684 0.198629 0.232371 -0.315281 -0.309463 0.389209 -0.350121 -0.343531 0.275172 0.274191 0.273911 0.278915 0.273489 0.282780 0.281820 0.293003 0.291223
chargesum: 0.00000
title: Mulliken charges with hydrogens summed into heavy atoms:
elementType: S O O O O N C C C C C C C C C C
charge: 0.168225 -0.294364 -0.237919 -0.197698 -0.198788 0.028160 0.318996 -0.122970 -0.114281 0.198629 0.232371 -0.032500 -0.027643 0.389209 -0.057118 -0.052307
polarizability: 2.38763247e+02 -7.35283169e-01 1.38870320e+02 -7.45191704e-01 2.69562770e+00 8.21043814e+01
1716.lowfreq: -12.7748 -5.0225 -0.0018 -0.0012 0.0005 6.4356 10.9735 34.8096 49.5073
frequency: -12.7028 34.7866 49.4750 52.5774 72.9152 93.9803 115.9071 198.5839 214.8660 248.0209 282.5543 341.8579 363.5702 410.3228 451.9391 460.4130 487.8779 513.9984 532.9990 615.1074 624.1407 651.0623 670.9298 683.9832 688.1199 764.2329 770.4207 811.0901 843.9220 848.7354 864.2805 889.3166 941.1376 997.4336 1000.1950 1004.8539 1005.1270 1012.2573 1049.1842 1089.1566 1090.0247 1108.9985 1169.0738 1176.0331 1187.4927 1199.8926 1212.9243 1239.9401 1292.2249 1309.7147 1330.6487 1369.2390 1406.0230 1415.1244 1443.8633 1460.9753 1475.5677 1591.8610 1610.5349 1627.5990 3055.5397 3057.2579 3071.3014 3145.7319 3148.2576 3165.5276 3176.5632 3188.2046 3194.1251
redmass: 3.7244 6.7111 10.5885 8.2826 5.6599 7.5726 4.7912 9.2847 6.2094 7.0029 7.1696 6.1844 5.6007 2.8799 3.3190 3.9163 9.6891 5.7114 7.1928 5.9570 7.1152 6.2610 6.1789 3.9191 5.3767 5.1102 9.2920 7.5056 4.4293 1.2748 1.2451 1.6672 1.2933 2.7148 1.1218 3.3012 1.3433 1.3685 5.2342 3.2773 3.3861 1.3122 1.5071 1.2331 1.2340 1.3529 6.6472 4.2739 1.2627 1.3647 1.2851 7.7940 8.2186 4.5846 1.0908 1.1203 2.4469 8.7926 6.3991 11.0108 1.0553 1.0582 1.0866 1.1116 1.1121 1.0902 1.0891 1.0960 1.0974
irintensity: 0.8099 0.0936 1.7964 1.2659 0.7805 3.4791 1.4197 2.7172 11.6558 1.2279 4.5055 1.6956 6.5690 0.0013 7.8439 2.0293 6.5027 0.4533 6.6258 1.0781 0.7267 0.0125 2.3705 56.8040 3.4361 3.6129 26.3199 14.8549 39.4198 1.0172 0.6405 54.6297 9.7228 43.0852 1.8197 117.1942 0.6017 0.0040 449.6164 11.4957 3.3536 11.6201 0.8448 3.7588 19.2547 25.8658 506.7480 171.2472 0.3814 6.4617 6.9574 83.5208 10.7048 67.0816 7.8188 9.5555 3.9564 38.4516 3.2791 151.5571 33.0579 4.2107 7.1950 5.3827 12.9865 1.3573 1.2104 0.6017 0.5996
temp: 298.150 k
press: 1.00000 atm
elementType: 16 8 8 8 8 7 6 6 6 6 6 6 6 6 6 6 1 1 1 1 1 1 1 1 1
symmnumber: 1
zpe: 464579.3 jmol-1
zpe.correction: 0.176949 hartree
zpe.thermalcorrener: 0.190581 hartree
zpe.thermalcorrenthalpy: 0.191525 hartree
zpe.thermalcorrgfe: 0.134237 hartree
zpe.sumelectzpe: -1138.913441 hartree
zpe.sumelectthermal: -1138.899808 hartree
zpe.sumelectthermalent: -1138.898864 hartree
zpe.sumelectthermalfe: -1138.956152 hartree
dipole: 2.8952 -0.1021 -0.2113
dipole: 2.9047
quadrupole: -137.0771 -102.2375 -95.4127
quadrupole: -6.5611 -0.4144 1.2261
quadrupole: -25.5014 9.3383 16.1631 -6.5611 -0.4144 1.2261
hfenergy: -1139.0903894 hartree
pointgroup: C01 [X(C10H9N1O4S1)]
dipole: 1.1359228 -0.1041401 -0.0691382 debye
dipolederiv: -0.3044327 0.0492337 -0.0185325 0.1196942 -0.1615247 -0.0039204 -0.0622608 0.0030663 -0.1643755 -2.0849442 0.5535323 -0.1609259 0.7331586 -0.6907644 0.1286951 -0.1500114 0.1167886 -0.2721857 -0.8575513 -0.1994164 0.0703983 0.1102772 -0.8728896 0.171663 -0.0061143 0.1615237 -0.3485829 -0.8375653 0.1709507 -0.0260733 0.1348273 -0.5560916 0.0844785 -0.0141767 0.0827251 -0.2427254 -0.6695276 -0.1713661 0.0594042 -0.1727283 -0.6960414 0.1306491 0.0618811 0.1320687 -0.2583211 1.8205195 0.1054786 -0.0797281 0.157595 1.0546903 -0.2327751 -0.0992742 -0.2325317 0.2558815 1.3808743 -0.3029778 0.1115231 -0.0144653 0.1437488 -0.0767176 -0.0351284 -0.0381234 0.1394247 0.0255748 0.1275189 0.0986823 0.0566072 0.0344394 -0.0174808 0.0459851 -0.0174607 0.2040562 0.0076711 -0.0100584 -0.1608923 -0.0128512 0.1674407 0.0765325 -0.0518481 0.0604481 0.0536036 2.2643778 -0.0710096 -0.0266114 -0.7522245 1.3130596 -0.307128 0.1489222 -0.2943109 0.31823 -0.5106621 -0.0706941 0.0311996 -0.0605242 0.0171526 -0.0001326 0.0329072 -0.0032919 -0.0031263 -0.1541621 0.1779953 -0.0467523 -0.047107 0.057722 -0.0411374 0.0124162 -0.0461588 -0.0822582 -0.033732 -0.1898939 0.0474213 -0.0333576 -0.0689713 -0.0065 0.0094593 0.0001905 -0.0963592 -0.5930835 -0.1285952 0.0540227 -0.1571467 0.0888218 -0.0008099 0.0647696 -0.0011312 0.0671638 0.0531798 -0.1626979 0.0373181 0.1176463 -0.0814589 -0.0100973 -0.0365609 -0.000696 -0.1034341 0.0055755 0.1931561 -0.0547327 -0.0639125 -0.0347805 -0.0156078 0.0135594 -0.0250776 -0.0970051 0.0097194 0.0235674 -0.0099721 -0.0778702 0.0130772 0.0529074 0.0159565 0.0363063 0.0493355 0.0000079 -0.1285475 -0.0405635 -0.0740247 -0.0243753 -0.0064517 -0.0132924 0.0228516 0.0529671 0.0354229 0.0055185 -0.0291436 0.0096195 0.0913748 0.0298179 0.0244173 -0.0220434 -0.1214357 0.0351522 0.0325298 0.0133435 -0.0188093 -0.0584928 -0.1152925 -0.0210678 -0.0606819 0.0403124 0.0017037 -0.0311899 0.1277873 -0.0255294 0.0231358 0.0538529 0.0708968 0.0206506 -0.0046667 0.1252604 -0.0489305 0.0147255 -0.0244074 0.0322671 0.0328773 0.0077898 0.033421 0.1435119 0.0874656 0.056915 -0.011584 0.084006 0.0534927 0.0227422 -0.0210982 0.0222562 0.140214 0.0779006 0.0577923 -0.0125381 0.0262308 0.0961459 0.0195315 -0.0036828 0.0182978 0.1679822 0.1152556 -0.0388115 0.0122238 -0.0147039 0.0588217 0.0303037 0.0055556 0.0309132 0.161793 unknown
polarizability: 238.5408887|-4.8539289|136.7654458|-0.8363094|-11.5530907|84.431614 unknown
InChI: InChI=1S/C10H9NO4S/c12-10(15-9-5-16-6-9)7-1-3-8(4-2-7)11(13)14/h1-4,9H,5-6H2
charge 0 multiplicity 1
25 atoms
S  5.797017 -0.990251 0.338458
O  2.126749 -0.230763 -0.078748
O  1.690114 1.996767 -0.654945
O  -5.175452 0.500786 -0.018967
O  -4.644977 -1.648364 0.532173
N  -4.324339 -0.443292 0.201118
C  3.590385 -0.003498 -0.191322
C  4.305743 -1.189131 -0.871749
C  4.329133 -0.048529 1.166721
C  1.279271 0.855693 -0.338698
C  -0.160763 0.480193 -0.18956
C  -1.133915 1.486271 -0.42557
C  -0.561913 -0.831286 0.175543
C  -2.87682 -0.121153 0.064647
C  -2.503146 1.191191 -0.299617
C  -1.929003 -1.139812 0.304829
H  3.762249 0.951672 -0.715005
H  3.806689 -2.152487 -0.688548
H  4.572457 -1.064294 -1.930033
H  4.611895 0.916659 1.608277
H  3.83659 -0.705651 1.899302
H  -0.795891 2.488783 -0.705118
H  0.20004 -1.593716 0.353685
H  -3.276275 1.943475 -0.474273
H  -2.272238 -2.139064 0.583897
