program: Gaussian 09
title: 000289914
version: EM64L-G09RevD.01
frameworkgroup: C1[X(C8H16O)]
method: RPBEPBE
basis: SDD
operation: Freq
keyword: #pfreq=noraman
keyword: PBEPBE/SDD
title: #p freq=noraman PBEPBE/SDD
converged: YES YES NO NO
title: Mulliken charges:
elementType: O C C C C C C C C H H H H H H H H H H H H H H H H
charge: -0.309081 -0.081691 -0.081796 -0.422519 -0.422467 -0.351752 -0.351579 -0.694032 -0.694097 0.228504 0.228648 0.214271 0.206214 0.214057 0.206296 0.200856 0.204639 0.200844 0.204621 0.218560 0.213133 0.218356 0.218501 0.213137 0.218377
chargesum: 0.00000
title: Mulliken charges with hydrogens summed into heavy atoms:
elementType: O C C C C C C C C
charge: -0.309081 0.146814 0.146852 -0.002034 -0.002114 0.053742 0.053886 -0.043983 -0.044083
polarizability: 9.94826191e+01 1.52845196e-03 8.58479716e+01 -1.33734329e+00 -2.02319890e-04 7.71079383e+01
1716.lowfreq: -29.1968 -20.4432 -12.4893 -2.8412 -0.0008 -0.0007 -0.0007 45.6946 82.3104
frequency: -14.6049 44.5381 82.2898 107.1975 109.9707 189.8868 224.6255 227.4968 298.0907 308.1624 362.9354 426.5136 467.1087 475.7400 715.4708 730.4568 781.6208 794.9818 861.8453 863.2985 877.3928 878.9112 952.9935 999.7548 1016.9046 1049.0093 1060.5892 1082.0473 1104.2075 1131.6078 1134.7906 1146.3521 1210.9713 1219.2176 1241.7436 1258.1888 1264.4446 1312.8711 1328.1278 1329.9034 1337.7062 1352.0548 1389.6615 1390.1037 1444.6147 1467.1239 1467.9391 1468.2450 1472.6706 1479.3092 1479.5833 1486.0456 1486.3854 2972.9479 2973.4505 2975.5980 2975.7222 2980.7203 2981.2185 3025.2623 3026.3004 3039.7596 3040.8118 3069.0779 3071.2844 3071.8410 3072.0991 3076.2057 3083.3433
redmass: 2.8101 2.6072 2.7802 1.7007 2.0159 2.3370 1.4443 1.2077 3.0285 1.8528 2.6975 2.1928 3.8143 2.7289 2.2796 1.4330 1.7419 2.0684 2.3677 2.3943 1.3544 2.0932 1.4730 1.6204 1.2216 1.2591 1.8759 2.6077 1.8543 1.6334 2.1847 2.2458 1.2938 1.3832 1.3201 1.2504 1.2129 1.1677 1.4820 1.3886 1.3972 1.3715 1.2176 1.2173 2.8272 1.0712 1.0853 1.0817 1.0998 1.0529 1.0531 1.0604 1.0616 1.0568 1.0567 1.0402 1.0401 1.0620 1.0619 1.0984 1.0982 1.0993 1.0999 1.0959 1.1004 1.0983 1.0998 1.0969 1.0902
irintensity: 0.0019 0.9962 0.3579 0.1207 1.9949 0.7991 0.4603 0.2277 2.0876 1.9431 5.8931 0.0093 9.0341 0.9948 2.2436 4.2203 33.7213 23.8036 0.0359 7.1468 3.6150 12.9598 16.0546 1.4787 4.0550 1.8626 0.4214 0.7657 0.1602 0.5508 5.2238 6.3785 0.1932 1.7461 1.3894 1.5755 0.0228 5.7085 2.4478 3.6284 0.0587 0.6185 16.7225 17.7991 1.7046 1.0885 10.2498 7.4334 1.9523 8.0492 23.5336 5.8757 18.4483 69.8042 12.5946 24.4831 19.0555 21.3919 21.0344 51.1145 1.4356 36.7277 1.0221 16.1394 112.3066 48.5087 62.7705 6.2837 89.2947
temp: 298.150 k
press: 1.00000 atm
elementType: 8 6 6 6 6 6 6 6 6 1 1 1 1 1 1 1 1 1 1 1 1 1 1 1 1
symmnumber: 1
zpe: 585149.4 jmol-1
zpe.correction: 0.222872 hartree
zpe.thermalcorrener: 0.233422 hartree
zpe.thermalcorrenthalpy: 0.234366 hartree
zpe.thermalcorrgfe: 0.186399 hartree
zpe.sumelectzpe: -388.877811 hartree
zpe.sumelectthermal: -388.867261 hartree
zpe.sumelectthermalent: -388.866316 hartree
zpe.sumelectthermalfe: -388.914283 hartree
dipole: -0.0007 -2.7528 -0.0017
dipole: 2.7528
quadrupole: -53.1164 -67.0308 -56.1014
quadrupole: -0.0048 0.2218 -0.0069
quadrupole: 5.6331 -8.2813 2.6482 -0.0048 0.2218 -0.0069
hfenergy: -389.1006823 hartree
pointgroup: C01 [X(C8H16O1)]
dipole: -0.0145882 -1.0829237 -0.0063274 debye
dipolederiv: -0.5247651 -0.002932 -0.0721475 -0.0033946 -0.7808888 -0.001627 -0.0490692 -0.002234 -0.3105374 0.3199591 -0.0574403 0.0423981 -0.1449632 0.2251198 0.02694 0.0559927 -0.0604309 0.265418 0.3251461 0.054206 0.0420243 0.141242 0.2194119 -0.0283451 0.0595314 0.0587537 0.2652978 0.0378648 0.0759212 -0.0643528 0.0679512 0.0104078 -0.0252827 -0.0190149 0.0005599 0.035515 0.0337841 -0.076038 -0.0641072 -0.0683618 0.0143806 0.0268247 -0.0190869 -0.0003406 0.036055 0.138237 0.0134294 0.0108162 -0.0170244 0.1133206 -0.0013022 -0.0315358 0.0154933 0.1020855 0.1383496 -0.0143845 0.0109296 0.0161974 0.1134693 0.0007957 -0.0320256 -0.014688 0.1019872 0.0890382 0.0182208 0.0134535 0.030593 0.0120297 -0.0565976 0.0235661 -0.0563242 -0.0387712 0.0868831 -0.0210274 0.015928 -0.0333161 0.0126241 0.0563517 0.0255454 0.0556413 -0.0372972 0.0163961 0.0321568 -0.0263064 0.0329328 0.0648908 -0.0497964 -0.0063771 -0.0629197 -0.1328343 0.014982 -0.0304758 -0.0250891 -0.0315296 0.0651216 0.0527243 -0.0051876 0.0653888 -0.1313713 0.0630943 0.0513181 0.0549699 0.0320779 0.0186616 -0.0712343 -0.0013665 -0.0799963 -0.119837 -0.1377664 -0.0812795 0.052427 -0.0732209 0.0018851 0.0417646 0.062022 0.0866167 0.0453506 0.0604097 -0.053202 0.0569829 -0.033702 0.0198562 0.0707177 0.0010434 0.0810951 -0.1188477 -0.1333845 0.0846636 0.0516834 0.0767726 -0.0015166 -0.0434828 0.0597671 -0.0886539 0.0444934 -0.0764957 -0.1114907 0.1138714 -0.0856893 -0.0203302 0.0290831 0.1080341 0.0204957 -0.0060252 -0.1124932 0.0712326 -0.1377641 0.0707378 0.0262041 0.0042696 -0.1216364 0.0115662 -0.054857 -0.0714218 0.1123745 0.1134332 0.0868932 -0.0258025 -0.0323223 0.1077162 -0.023435 -0.00559 -0.1154544 -0.0660424 -0.1383116 -0.0654647 0.0302765 0.0003884 -0.1224777 -0.0075006 -0.0560955 -0.0793613 0.0024333 -0.1373778 0.0114425 0.0971101 0.0229642 -0.1246194 0.0059221 -0.0331509 -0.0671977 -0.0796685 0.099695 -0.1315968 0.0274415 0.0683295 0.0773903 0.0263061 0.017627 0.0697527 0.0755757 0.0137712 0.1014434 -0.1841927 -0.022604 0.0002886 0.0106072 0.0741673 -0.0788321 0.0048781 -0.1382496 -0.0042013 0.0977214 -0.0168651 -0.124528 -0.000288 -0.0343583 -0.0599969 0.0821041 0.0975571 0.1343475 0.0207704 -0.0714156 0.0772264 -0.0286635 0.0173815 0.0632724 -0.084533 0.0137654 -0.1101664 -0.1779721 0.0197213 -0.0011986 -0.0129715 0.0741948 unknown
polarizability: 99.2642854|-0.162081|85.8496835|-2.5649577|0.0780838|77.3245602 unknown
InChI: InChI=1S/C8H16O/c1-3-5-7-8(9-7)6-4-2/h7-8H,3-6H2,1-2H3
charge 0 multiplicity 1
25 atoms
O  0.02736 2.191391 0.011513
C  0.686269 0.863218 -0.320685
C  -0.666136 0.876867 0.327561
C  1.948266 0.526418 0.453291
C  -1.936267 0.58323 -0.450476
C  2.261122 -0.993725 0.475476
C  -2.294019 -0.92666 -0.484844
C  2.583214 -1.5895 -0.914097
C  -2.641045 -1.522386 0.898825
H  0.710626 0.678482 -1.404721
H  -0.695931 0.6797 1.409265
H  1.828492 0.901835 1.487798
H  2.805466 1.073798 0.012424
H  -1.804099 0.962944 -1.481916
H  -2.777761 1.152101 -0.006531
H  1.403728 -1.536712 0.922419
H  3.1237 -1.162493 1.149513
H  -1.45125 -1.49206 -0.931776
H  -3.158068 -1.064661 -1.1640
H  1.717508 -1.526327 -1.598619
H  3.426735 -1.052812 -1.387999
H  2.864811 -2.655286 -0.832808
H  -1.776101 -1.496368 1.586827
H  -3.466547 -0.960118 1.374776
H  -2.960073 -2.576776 0.807585
