program: Gaussian 09
title: 000289911
version: EM64L-G09RevD.01
frameworkgroup: C1[X(C11H21NO)]
method: RPBEPBE
basis: SDD
operation: Freq
keyword: #p
keyword: freq=noraman
keyword: PBEPBE/SDD
title: #p freq=noraman PBEPBE/SDD
converged: YES YES NO NO
title: Mulliken charges:
elementType: O N C C C C C C C C C C C H H H H H H H H H H H H H H H H H H H H H
charge: -0.242734 -0.109583 0.365955 -0.174199 -0.453706 -0.457603 -0.352715 -0.399094 -0.405479 -0.790175 -0.030085 -0.708507 -0.706405 0.231673 0.205799 0.198407 0.194252 0.205210 0.210299 0.203874 0.215366 0.195282 0.193498 0.222019 0.211819 0.217312 0.242526 0.208529 0.216873 0.221887 0.211423 0.255999 0.191363 0.210920
chargesum: 0.00000
title: Mulliken charges with hydrogens summed into heavy atoms:
elementType: O N C C C C C C C C C C C
charge: -0.242734 -0.109583 0.365955 0.057475 -0.049501 -0.058141 0.061458 0.011553 0.010038 -0.118517 0.178444 -0.058324 -0.048123
polarizability: 1.36629184e+02 3.97428164e+00 1.23027320e+02 5.79460710e-02 1.40392690e+00 1.13755218e+02
1716.lowfreq: -31.8954 -22.8263 -16.1730 -0.0008 -0.0007 -0.0005 55.8753 75.2538 127.3067
frequency: 55.7292 75.2294 127.2831 161.0357 177.7414 208.1359 211.5419 226.9853 243.0616 259.0446 275.3707 320.4770 341.5010 354.9992 381.1703 434.2968 452.4504 475.6217 508.8589 581.0903 591.6166 624.2343 664.9884 750.2110 773.4991 810.4356 840.3350 863.8872 883.0968 889.4837 924.1586 925.6595 949.1392 961.9246 974.8648 987.2412 992.6959 1008.5909 1036.7021 1072.7778 1102.3822 1119.0785 1124.9747 1142.8547 1146.2082 1165.2095 1173.3532 1189.9149 1204.9751 1232.5612 1233.6974 1260.9833 1293.0112 1302.3826 1314.4284 1324.2813 1331.0503 1331.9742 1337.2675 1348.2833 1357.8773 1368.7318 1373.8081 1387.7159 1453.2555 1453.6668 1457.9139 1466.1190 1466.8221 1473.3618 1475.1661 1476.4482 1477.5628 1485.7547 1496.3255 2928.6455 2967.7600 2971.4362 2974.8209 2979.4688 2983.8169 2985.5755 2987.4390 2997.7015 3008.7416 3023.5423 3036.8503 3050.8864 3063.2024 3067.5132 3071.1606 3075.4437 3079.3677 3083.3345 3090.4830 3115.3621
redmass: 2.8587 2.5415 2.0935 3.2006 1.3771 1.5393 1.8262 1.0639 1.5719 2.4070 2.1384 2.6240 2.5152 2.8026 2.3924 2.6024 2.7815 2.8375 3.2218 3.4640 2.6202 3.5168 3.3879 1.5842 2.1840 4.6458 2.4882 2.6830 2.2279 1.8833 1.6666 1.2593 1.5692 2.1989 2.0798 2.1001 2.5687 1.7532 1.7077 2.5938 2.1693 1.6779 2.3839 1.9122 1.9657 2.3215 1.9396 1.3776 1.3981 1.5440 1.5994 1.2570 1.4217 1.2983 1.4621 1.4726 1.3260 1.3235 1.3219 1.4042 1.4112 1.2256 1.2143 1.2115 1.0547 1.0700 1.0771 1.0519 1.0888 1.0719 1.0593 1.0500 1.0731 1.0701 1.0552 1.0821 1.0647 1.0619 1.0396 1.0609 1.0361 1.0622 1.0365 1.0669 1.0834 1.0983 1.0983 1.0961 1.1018 1.0990 1.0990 1.0999 1.0995 1.0985 1.0995 1.0983
irintensity: 0.0843 0.0456 1.0608 4.3250 0.5790 1.0100 0.0818 0.2013 2.1041 0.7297 0.9836 0.2200 2.4306 0.7710 2.6045 1.5125 1.6138 1.4280 0.5618 1.8453 1.2322 5.6391 2.9461 10.6782 6.0697 4.2489 2.8894 6.8290 4.5901 2.8706 4.8721 2.1200 0.2392 14.1981 3.7259 0.5706 22.4946 1.6939 2.4123 0.1039 3.6279 1.8361 1.3718 10.4305 4.9451 24.9428 13.4048 1.7655 6.7262 1.9098 2.4440 1.9249 5.2392 0.2066 8.4045 1.3154 3.6687 9.3514 0.9822 2.4008 9.4579 18.7663 24.6002 22.4466 5.4746 2.8497 3.1936 11.5646 8.6248 4.4621 7.4687 7.2894 17.5965 20.0740 14.3780 43.0692 41.1126 43.2549 23.7341 38.4692 26.4930 46.2570 33.1214 64.1319 28.3060 64.9525 6.0767 35.8993 49.0841 62.3712 58.3821 9.0715 19.7521 59.7762 39.5755 16.2353
temp: 298.150 k
press: 1.00000 atm
elementType: 8 7 6 6 6 6 6 6 6 6 6 6 6 1 1 1 1 1 1 1 1 1 1 1 1 1 1 1 1 1 1 1 1 1
symmnumber: 1
zpe: 797246.0 jmol-1
zpe.correction: 0.303655 hartree
zpe.thermalcorrener: 0.317390 hartree
zpe.thermalcorrenthalpy: 0.318334 hartree
zpe.thermalcorrgfe: 0.264807 hartree
zpe.sumelectzpe: -560.620913 hartree
zpe.sumelectthermal: -560.607178 hartree
zpe.sumelectthermalent: -560.606233 hartree
zpe.sumelectthermalfe: -560.659761 hartree
dipole: -1.1607 0.9080 1.1188
dipole: 1.8502
quadrupole: -78.4613 -81.7882 -81.9973
quadrupole: 4.0114 0.3227 -0.1940
quadrupole: 2.2876 -1.0393 -1.2484 4.0114 0.3227 -0.1940
hfenergy: -560.9245679 hartree
pointgroup: C01 [X(C11H21N1O1)]
dipole: 0.4603522 0.3255244 -0.4604308 debye
polarizability: 136.4104297|-4.3465817|123.1079179|-0.0686392|-1.7582778|113.8933742 unknown
InChI: InChI=1S/C11H21NO/c1-9(2)12-11(3)7-5-4-6-10(11)8-13-12/h9-10H,4-8H2,1-3H3
charge 0 multiplicity 1
34 atoms
O  -0.771026 -1.731607 0.257848
N  -0.75945 -0.186273 0.254883
C  0.265285 0.088866 -0.852179
C  1.39058 -0.977642 -0.519164
C  0.854179 1.517027 -0.713402
C  2.630282 -0.376472 0.191369
C  0.659854 -2.030806 0.361633
C  1.428542 1.831953 0.691373
C  2.219391 0.630063 1.290022
C  -0.286332 -0.156331 -2.279054
C  -2.206185 0.155715 0.030557
C  -2.391352 1.681607 -0.118734
C  -3.014341 -0.3562 1.242969
H  1.712064 -1.443472 -1.469464
H  0.105987 2.279285 -0.993237
H  1.662378 1.595611 -1.469049
H  3.281636 0.127977 -0.550014
H  3.234539 -1.197495 0.627101
H  0.781848 -3.066983 0.001934
H  0.986012 -1.960568 1.419159
H  0.603282 2.099446 1.375318
H  2.082784 2.721873 0.607798
H  3.114679 0.986053 1.833927
H  1.580705 0.109335 2.027348
H  -1.056963 0.584527 -2.560513
H  0.529987 -0.082581 -3.021117
H  -0.728639 -1.16647 -2.351408
H  -2.581349 -0.352353 -0.886373
H  -3.470557 1.915242 -0.079985
H  -1.896536 2.215173 0.713063
H  -2.000328 2.07217 -1.073234
H  -2.881084 -1.441643 1.369757
H  -4.089372 -0.139142 1.101078
H  -2.670699 0.146113 2.165788
