program: Gaussian 09
title: 000289909
version: EM64L-G09RevD.01
frameworkgroup: C1[X(C16H23NO)]
method: RPBEPBE
basis: SDD
operation: Freq
keyword: #p
keyword: freq=noraman
keyword: PBEPBE/SDD
title: #p freq=noraman PBEPBE/SDD
converged: YES YES NO NO
title: Mulliken charges:
elementType: O N C C C C C C C C C C C C C C C C H H H H H H H H H H H H H H H H H H H H H H H
charge: -0.270757 -0.109485 -0.157798 -0.225096 0.309498 -0.457147 -0.443500 0.036399 -0.454100 -0.727285 -0.733838 -0.754585 0.397136 -0.371078 -0.412016 -0.223824 -0.195178 -0.271014 0.232620 0.236057 0.197032 0.202962 0.230570 0.220384 0.189490 0.207227 0.203748 0.204176 0.231239 0.229823 0.247867 0.222501 0.207215 0.219098 0.213832 0.211098 0.227067 0.267748 0.218922 0.219552 0.223441
chargesum: 0.00000
title: Mulliken charges with hydrogens summed into heavy atoms:
elementType: O N C C C C C C C C C C C C C C C C
charge: -0.270757 -0.109485 0.074821 0.010961 0.309498 -0.057153 0.007454 0.225889 -0.043125 -0.062047 -0.056256 -0.110557 0.397136 -0.144011 -0.144267 -0.004902 0.024374 -0.047573
polarizability: 2.33508864e+02 1.67732199e+01 1.72650961e+02 9.83809675e+00 -1.51248082e+01 1.39376659e+02
1716.lowfreq: -18.7259 -11.7508 -0.0002 0.0005 0.0006 5.4389 35.6032 50.6426 59.0955
frequency: 35.1376 50.3191 59.0939 100.8703 106.3993 146.0689 176.2177 193.6109 213.9968 225.3101 249.9013 254.8435 271.7683 283.1522 299.8199 332.0776 367.9106 395.4185 406.7772 418.9648 426.5957 458.2637 481.5493 509.8966 538.6279 566.1162 612.5994 618.0408 658.0620 692.3647 734.4815 749.4335 772.9859 779.9106 816.4359 827.4695 846.8715 881.0624 886.4262 900.0576 912.3492 921.5365 929.5599 959.4883 961.6975 972.3482 978.1325 980.2663 982.1518 994.5269 1013.0121 1031.1292 1058.6183 1085.1560 1095.8046 1108.2194 1115.9795 1130.2831 1154.9485 1166.5300 1169.0183 1186.7275 1189.2843 1218.7002 1232.1901 1248.7800 1262.1388 1290.3002 1301.4225 1311.2572 1312.6777 1321.0931 1335.4538 1337.5071 1338.9301 1357.4871 1364.4589 1372.5174 1382.2040 1390.0879 1391.7907 1443.7060 1449.4561 1456.5190 1463.7996 1466.5343 1473.0859 1473.8744 1476.3763 1479.1859 1480.8375 1489.0417 1579.0129 1612.4054 2934.6738 2965.5613 2967.2103 2977.1847 2978.7996 2983.8301 2995.3930 2998.8021 3017.9129 3020.5255 3035.9598 3046.4117 3062.2516 3067.0874 3074.7345 3086.6833 3094.5409 3112.3013 3120.7640 3129.0860 3145.2797 3161.6389 3187.7309
redmass: 3.8051 3.1220 3.4007 3.5974 3.1513 1.3194 2.4384 2.4536 1.1497 2.4912 1.8889 2.0015 1.9024 2.3983 2.6722 3.2064 2.6762 3.2873 2.9595 2.9359 2.3150 3.0964 3.2566 3.1390 3.8712 3.5922 5.6042 5.0003 3.6777 2.0962 2.7945 1.7061 4.6195 2.1330 3.5751 1.2599 2.2010 2.6093 1.5960 2.0307 1.6769 2.7584 1.5392 1.3851 1.8323 1.6041 1.4511 3.8908 1.8263 1.4893 3.2757 2.0639 1.9300 1.7533 1.9988 1.5435 1.5240 1.9720 2.3682 1.6542 1.2125 1.1359 2.3301 1.9647 1.4947 1.4473 1.6980 1.3354 1.6802 1.3024 1.9714 1.4515 1.4684 1.4422 1.4914 1.5641 1.3309 1.2627 6.4071 1.2158 1.2366 2.5354 1.0594 1.0697 1.0682 1.0640 1.0587 1.0666 1.0655 1.1955 1.9155 1.0631 6.2903 6.1594 1.0824 1.0643 1.0362 1.0605 1.0361 1.0606 1.0549 1.0636 1.0867 1.0959 1.1023 1.1008 1.0991 1.0992 1.0984 1.0989 1.1005 1.0985 1.0844 1.0886 1.0936 1.0993 1.0946
irintensity: 0.3367 0.9901 0.0948 1.4464 0.2142 0.2066 1.1125 0.1775 0.1004 1.0483 1.6207 0.0992 0.9702 0.3529 2.6599 4.6627 3.3857 7.3757 0.0656 1.3016 3.7048 10.4468 6.8178 2.9125 59.3892 13.2267 0.7002 1.0310 4.7890 33.3557 2.5212 92.1115 15.9448 6.9909 19.4441 0.4442 3.0806 3.4133 7.0869 10.8440 9.4029 10.4676 2.0211 0.1223 2.0886 6.6222 0.7508 3.0919 4.8068 1.0371 0.8319 22.7104 3.3155 5.4454 3.3420 3.6890 29.8694 8.1432 50.2121 13.6408 7.4934 6.2631 14.7232 14.4358 16.0162 7.5499 2.0765 2.0932 50.7247 0.1535 30.3026 3.8840 1.7628 13.0850 24.8447 6.1794 3.0774 32.0354 8.1374 10.0794 22.5531 2.6369 3.6521 0.5769 12.2648 1.3235 8.5755 14.1636 11.0223 11.7196 110.4360 23.3384 6.3868 130.3559 22.9311 24.9022 31.3124 44.7588 21.5786 25.7381 18.5165 22.7278 29.3144 37.4742 43.6475 27.5798 71.6807 42.0919 14.9908 32.0772 26.5250 30.2856 6.9563 11.2934 40.8285 28.6010 2.7822
temp: 298.150 k
press: 1.00000 atm
elementType: 8 7 6 6 6 6 6 6 6 6 6 6 6 6 6 6 6 6 1 1 1 1 1 1 1 1 1 1 1 1 1 1 1 1 1 1 1 1 1 1 1
symmnumber: 1
zpe: 931405.7 jmol-1
zpe.correction: 0.354754 hartree
zpe.thermalcorrener: 0.372026 hartree
zpe.thermalcorrenthalpy: 0.372970 hartree
zpe.thermalcorrgfe: 0.310442 hartree
zpe.sumelectzpe: -752.058210 hartree
zpe.sumelectthermal: -752.040938 hartree
zpe.sumelectthermalent: -752.039994 hartree
zpe.sumelectthermalfe: -752.102522 hartree
dipole: -3.1772 0.6339 -0.8468
dipole: 3.3487
quadrupole: -106.2742 -107.0208 -108.5855
quadrupole: 3.6915 2.2601 -4.3966
quadrupole: 1.0193 0.2727 -1.2920 3.6915 2.2601 -4.3966
hfenergy: -752.412964 hartree
pointgroup: C01 [X(C16H23N1O1)]
dipole: -1.2582913 0.2224238 -0.3208888 debye
polarizability: 232.9722732|17.9045709|173.3230669|9.1727409|-15.163892|139.2411433 unknown
InChI: InChI=1S/C16H23NO/c1-12-9-10-14-15(11-12)17(18-16(14,2)3)13-7-5-4-6-8-13/h4-8,12,14-15H,9-11H2,1-3H3
charge 0 multiplicity 1
41 atoms
O  -0.069709 -1.417599 0.645133
N  0.472697 -0.588196 -0.484505
C  -1.833523 -0.731936 -0.903926
C  -0.673418 0.309147 -0.824391
C  -1.416114 -1.861792 0.127958
C  -3.250275 -0.106309 -0.801211
C  -0.906097 1.443227 0.203261
C  -2.285214 2.119487 0.019544
C  -3.397235 1.060382 0.205849
C  -2.274502 -2.011385 1.392963
C  -1.235172 -3.211274 -0.596773
C  -2.458353 3.307877 0.988686
C  1.775809 -0.110905 -0.207553
C  2.307084 0.971516 -0.969732
C  2.606561 -0.758605 0.749595
C  3.641144 1.382861 -0.778209
C  3.938469 -0.330622 0.928798
C  4.470445 0.738881 0.170809
H  -1.763272 -1.205807 -1.901894
H  -0.486757 0.736411 -1.827544
H  -3.992478 -0.898963 -0.583049
H  -3.512073 0.283958 -1.806425
H  -0.095543 2.191391 0.115254
H  -0.840423 1.01614 1.223879
H  -2.351086 2.506447 -1.022368
H  -4.392488 1.52882 0.07206
H  -3.360419 0.690807 1.249437
H  -3.293752 -2.350967 1.136269
H  -1.822044 -2.76747 2.058744
H  -2.343803 -1.06472 1.951232
H  -0.464044 -3.110757 -1.380478
H  -0.915773 -3.995512 0.111828
H  -2.18138 -3.53261 -1.072182
H  -1.67292 4.070972 0.833751
H  -3.440912 3.798089 0.853369
H  -2.392291 2.967991 2.040312
H  1.685942 1.477041 -1.717093
H  2.194987 -1.581086 1.338371
H  4.033985 2.214243 -1.375231
H  4.565184 -0.838263 1.671497
H  5.505659 1.06489 0.316568
