program: Gaussian 09
title: 000289908
version: EM64L-G09RevD.01
frameworkgroup: C1[X(C12H15NO)]
method: RPBEPBE
basis: SDD
operation: Freq
keyword: #p
keyword: freq=noraman
keyword: PBEPBE/SDD
title: #p freq=noraman PBEPBE/SDD
converged: NO YES NO NO
title: Mulliken charges:
elementType: O N C C C C C C C C C C C C H H H H H H H H H H H H H H H
charge: -0.359845 0.071262 -0.055514 -0.665598 -0.665516 -0.213872 0.488747 -0.215461 -0.314761 -0.382780 -0.397529 -0.234538 -0.233878 -0.243112 0.191677 0.209631 0.250637 0.223523 0.223625 0.209658 0.250509 0.242019 0.269110 0.212558 0.231224 0.225568 0.226719 0.226279 0.229655
chargesum: 0.00000
title: Mulliken charges with hydrogens summed into heavy atoms:
elementType: O N C C C C C C C C C C C C
charge: -0.359845 0.071262 0.136164 0.018193 0.018277 0.028147 0.488747 0.053649 -0.102203 -0.151556 -0.171960 -0.007819 -0.007599 -0.013457
polarizability: 3.37713103e+02 -1.33900962e+01 1.37086302e+02 7.30423934e-03 2.33686186e-02 7.54750385e+01
1716.lowfreq: -0.0008 -0.0005 0.0007 5.0561 5.0824 16.8217 38.7683 39.6964 60.9809
frequency: 38.1777 39.6386 60.9800 64.9454 151.3795 180.6505 191.3623 209.6168 224.4426 238.7948 266.9441 307.1912 350.6084 365.6969 404.1949 423.9333 510.9290 511.1443 603.3440 615.3904 619.6381 630.4123 693.6527 762.3260 792.4813 804.2984 843.6287 863.1033 882.2763 921.7183 924.2908 927.4689 950.4063 976.9541 986.2934 987.5355 999.5370 1025.4951 1074.7449 1083.1935 1104.7552 1133.0055 1171.3398 1174.2142 1189.4398 1198.1826 1237.5894 1262.9727 1283.9075 1298.2449 1305.9230 1334.2991 1372.9106 1382.7886 1389.3449 1422.9935 1443.0098 1455.2390 1470.5123 1472.9617 1480.1315 1493.3993 1526.5873 1578.0876 1604.2396 1623.5803 2992.8869 2994.9248 3015.1065 3079.3833 3090.2363 3095.0387 3104.7570 3110.9248 3116.5526 3126.6037 3137.2137 3140.2995 3150.0010 3155.1651 3165.5029
redmass: 3.5673 3.8324 4.5986 4.0256 4.4516 3.4201 1.0904 2.0661 2.9929 1.3361 2.8323 3.6246 2.9728 3.2613 2.8038 4.0538 3.8682 3.0168 3.5051 6.2192 3.5595 5.3296 1.6931 1.5363 1.4511 4.6599 1.2886 3.5813 1.7197 3.0479 1.6201 1.1550 1.4787 1.3917 6.1325 1.1952 1.2201 2.1776 2.3146 1.6545 2.2118 2.1771 1.2580 1.5527 1.1729 1.8051 1.6492 1.7989 1.4865 1.6566 1.4745 1.2827 1.2122 3.4526 1.4106 1.9195 2.2847 1.0442 1.0581 1.0491 2.2831 1.0541 5.4747 5.4489 5.5890 5.3552 1.0350 1.0364 1.0846 1.0896 1.1008 1.1001 1.1007 1.1000 1.0869 1.0861 1.0908 1.0912 1.0955 1.0902 1.1014
irintensity: 0.9771 2.8344 1.6414 0.3081 3.9640 0.7712 0.0750 1.4629 1.4373 2.4020 0.5913 9.8610 2.0592 0.0212 0.0033 7.3153 1.7563 9.0708 9.0364 0.8078 3.4420 0.3581 44.9984 75.5774 1.7518 3.5953 0.5878 3.3875 5.1770 14.7126 3.2157 4.7394 0.0962 0.1888 0.3752 43.0343 34.0431 8.5754 62.2471 0.4219 105.9120 4.5271 13.4336 20.8173 0.0069 0.1037 4.6576 2.9774 135.8033 1.7854 1.7534 1.2201 22.7579 4.7410 30.5797 12.6857 5.1363 4.6067 23.4183 2.5921 34.4096 17.4479 37.8487 0.3433 3.2051 2.3484 26.3833 30.7908 18.8578 19.6054 19.3641 55.3777 1.9629 25.7207 9.8356 3.0409 12.2064 12.1440 33.2694 17.2800 34.6537
temp: 298.150 k
press: 1.00000 atm
elementType: 8 7 6 6 6 6 6 6 6 6 6 6 6 6 1 1 1 1 1 1 1 1 1 1 1 1 1 1 1
symmnumber: 1
zpe: 630390.6 jmol-1
zpe.correction: 0.240103 hartree
zpe.thermalcorrener: 0.254105 hartree
zpe.thermalcorrenthalpy: 0.255050 hartree
zpe.thermalcorrgfe: 0.198230 hartree
zpe.sumelectzpe: -595.158255 hartree
zpe.sumelectthermal: -595.144253 hartree
zpe.sumelectthermalent: -595.143308 hartree
zpe.sumelectthermalfe: -595.200128 hartree
dipole: -0.5870 -3.1382 0.0033
dipole: 3.1926
quadrupole: -66.7256 -79.6458 -88.8836
quadrupole: 8.7925 -0.0181 0.0099
quadrupole: 11.6927 -1.2274 -10.4653 8.7925 -0.0181 0.0099
hfenergy: -595.3983581 hartree
pointgroup: C01 [X(C12H15N1O1)]
dipole: 0.2285974 -1.2132513 0.2312627 debye
polarizability: 337.7571613|13.0199477|134.8899143|-1.1546495|-11.2907998|77.6273676 unknown
InChI: InChI=1S/C12H15NO/c1-11(2)13(14)10-6-9-12-7-4-3-5-8-12/h3-11H,1-2H3
charge 0 multiplicity 1
29 atoms
O  2.771879 1.451188 -0.253583
N  2.799755 0.144428 -0.002282
C  4.182984 -0.476214 0.120462
C  4.920296 0.189282 1.298668
C  4.927249 -0.292968 -1.216601
C  1.691933 -0.618906 0.136375
C  -2.155123 -0.343163 0.062115
C  0.373487 -0.068715 0.023849
C  -0.774149 -0.823628 0.161406
C  -2.492667 1.019865 -0.200618
C  -3.223159 -1.274058 0.235316
C  -3.837727 1.426111 -0.284076
C  -4.569863 -0.866007 0.151329
C  -4.885751 0.487927 -0.10887
H  4.028647 -1.552464 0.326164
H  5.940379 -0.224517 1.384341
H  4.987342 1.276326 1.123588
H  4.391193 0.020045 2.253084
H  4.399448 -0.798237 -2.044624
H  5.945039 -0.71428 -1.140096
H  5.000966 0.782004 -1.452741
H  1.85318 -1.681548 0.338963
H  0.331866 1.007393 -0.181535
H  -0.661403 -1.899445 0.367736
H  -1.698872 1.761684 -0.340019
H  -2.984559 -2.325981 0.437704
H  -4.075518 2.476626 -0.486319
H  -5.371941 -1.59995 0.288264
H  -5.930911 0.809603 -0.1747
