program: Gaussian 09
title: 000289907
version: EM64L-G09RevD.01
frameworkgroup: C1[X(C9H12N2O)]
method: RPBEPBE
basis: SDD
operation: Freq
keyword: #p
keyword: freq=noraman
keyword: PBEPBE/SDD
title: #p freq=noraman PBEPBE/SDD
converged: NO YES NO NO
title: Mulliken charges:
elementType: O N N C C C C C C C C C H H H H H H H H H H H H
charge: -0.221948 0.004733 -0.050289 -0.236276 -0.098387 -0.209097 -0.488076 -0.079942 -0.488862 -0.438202 -0.446162 -0.091897 0.273442 0.230046 0.290461 0.223717 0.226781 0.236222 0.232340 0.245459 0.211183 0.228472 0.238397 0.207887
chargesum: 0.00000
title: Mulliken charges with hydrogens summed into heavy atoms:
elementType: O N N C C C C C C C C C
charge: -0.221948 0.004733 -0.050289 0.037166 0.131659 0.081363 -0.037578 0.156280 -0.011063 0.001453 0.000122 -0.091897
polarizability: 1.32331123e+02 -2.43852789e+00 9.29067414e+01 4.06291222e+00 1.17414453e+00 8.41380223e+01
1716.lowfreq: -26.4684 -14.6997 -0.0007 -0.0005 -0.0003 9.3758 68.5531 112.4506 150.5507
frequency: 68.3182 112.4282 150.5393 209.6972 324.5036 351.0826 378.1107 400.8420 434.3043 464.9803 521.7036 570.6169 588.5644 618.5741 707.5684 723.8557 747.9339 770.6957 799.6094 822.8309 840.8016 870.7836 904.6449 922.5512 947.6770 969.2505 987.7178 1009.5576 1034.6804 1065.7861 1088.1385 1107.5839 1131.9694 1143.2642 1153.0411 1162.3173 1191.9918 1218.3254 1227.4160 1260.0406 1267.9537 1290.6050 1297.7432 1307.5243 1313.9633 1322.7980 1334.9811 1349.5276 1354.1951 1449.7056 1454.9481 1472.6852 1485.9230 2143.2919 2988.7263 2999.3340 3005.2655 3011.1055 3028.1183 3037.7511 3048.3046 3058.3265 3062.8044 3071.1495 3073.5601 3085.7928
redmass: 5.7074 4.4702 3.4129 5.2775 2.0790 2.1641 4.3027 2.1066 4.7927 5.7754 4.9399 6.8818 4.8386 6.5207 4.0421 2.2855 4.7827 3.5702 3.0731 2.6376 2.8041 3.1138 2.2935 3.0161 2.2189 2.0696 2.0879 2.2581 1.9390 1.7313 1.6632 2.0938 1.4117 2.5190 1.2854 1.2280 1.3801 1.3507 1.5134 1.3617 1.4208 1.4637 1.5205 1.4066 1.4630 1.5567 1.4215 1.4974 1.4250 1.0787 1.0852 1.0808 1.0875 12.6441 1.0627 1.0643 1.0627 1.0639 1.0876 1.0859 1.0965 1.0874 1.1019 1.1022 1.0917 1.1011
irintensity: 1.8837 1.9422 1.7633 5.7593 1.7781 2.2871 1.4072 0.3872 0.6220 0.1508 2.8282 5.9460 2.1258 5.9861 3.9930 1.3702 8.9361 4.8193 1.2634 10.2849 5.8489 3.4729 7.4454 2.3724 6.0133 5.2295 1.0578 3.9387 2.1900 1.3496 2.1175 4.0059 0.7911 11.6484 9.2470 1.6680 2.3994 3.4020 4.5934 4.6316 1.8627 3.8483 3.7833 1.2217 0.4955 0.6199 4.8886 9.4165 3.7447 2.7550 20.1021 18.1153 10.4914 91.9802 12.5399 35.3260 32.1654 21.1308 36.8276 69.2372 25.5304 14.1549 25.2056 36.6147 17.5627 25.2697
temp: 298.150 k
press: 1.00000 atm
elementType: 8 7 7 6 6 6 6 6 6 6 6 6 1 1 1 1 1 1 1 1 1 1 1 1
symmnumber: 1
zpe: 522291.9 jmol-1
zpe.correction: 0.198930 hartree
zpe.thermalcorrener: 0.208390 hartree
zpe.thermalcorrenthalpy: 0.209334 hartree
zpe.thermalcorrgfe: 0.164259 hartree
zpe.sumelectzpe: -533.895896 hartree
zpe.sumelectthermal: -533.886436 hartree
zpe.sumelectthermalent: -533.885492 hartree
zpe.sumelectthermalfe: -533.930567 hartree
dipole: -6.0167 -1.4169 1.6316
dipole: 6.3930
quadrupole: -90.1964 -66.9928 -70.4700
quadrupole: -2.6096 -0.2008 1.5394
quadrupole: -14.3100 8.8936 5.4164 -2.6096 -0.2008 1.5394
hfenergy: -534.0948264 hartree
pointgroup: C01 [X(C9H12N2O1)]
dipole: 2.4567968 0.4984318 0.2046498 debye
dipolederiv: -0.53506 0.0022144 0.0855673 -0.0694445 -0.3274012 -0.1056373 -0.1291026 0.1316021 -0.128875 -0.4129704 -0.0798424 0.066725 -0.3201239 0.15726 0.2814946 0.2041766 0.1001468 -0.261624 -0.5347174 -0.0174538 0.1091619 -0.0245311 -0.2319348 0.006621 0.0905522 0.0044986 -0.2728228 -0.0898652 -0.0025416 -0.0418114 0.0667917 -0.1435244 0.0081499 -0.0687446 0.0325064 0.0907714 0.1269467 0.0238247 -0.0169035 0.0064383 0.1132659 0.0176929 -0.0141758 -0.014138 0.0477329 0.4355878 0.0876501 -0.0424325 0.2581126 0.2345766 -0.0770102 0.0934001 -0.0756306 0.1663717 0.0458662 -0.0345781 0.0297806 0.0120103 0.1236592 0.0342973 -0.000974 0.0158734 0.0010198 0.440218 -0.0948481 -0.0516423 -0.0200068 0.3338562 -0.0975827 0.0927233 -0.1135901 0.1730571 -0.0617767 0.0300467 0.0261425 0.0261954 0.0778825 0.0138924 0.0115254 0.0397286 -0.0165178 0.107543 0.0125034 0.0088552 -0.0147526 0.0085134 0.0157212 -0.0203008 -0.012254 0.0784959 -0.0161741 -0.0008489 0.0764386 0.0513972 0.0242132 -0.0029912 0.0303934 -0.016121 0.0679627 0.6951889 0.0926109 -0.3270803 0.0691042 -0.1218027 -0.0761362 -0.3256616 -0.1008187 0.1891257 0.0239218 -0.0195185 0.0852779 -0.0245543 0.0379179 0.0290758 0.05223 0.020734 -0.1118501 -0.0997132 -0.1100525 0.0693767 -0.1087584 -0.0623049 0.0389182 0.0659846 0.0382471 0.0342259 0.0034109 0.0302982 0.0636495 0.0288971 -0.0091986 -0.0569882 0.0761049 -0.0552635 0.0330972 -0.0874402 0.073847 -0.0570541 0.1305737 -0.0048758 0.0833084 -0.0278053 0.0517688 0.0528316 0.058432 -0.0049533 0.0096529 -0.0637256 -0.0991747 -0.1377972 -0.0070889 -0.1025806 -0.0239874 -0.0438883 -0.0423913 0.0524943 -0.0056649 -0.0868238 0.0848043 -0.005829 0.1136923 -0.0375454 0.0319738 -0.0174355 0.0294579 -0.0077051 -0.1687785 -0.0031641 0.0157411 -0.0579132 0.0717878 0.0452931 0.0071411 -0.0677664 -0.0042386 0.0937689 -0.0469878 -0.0716068 0.0153253 -0.0710927 -0.1789988 0.0468943 0.1130905 0.0325593 0.0296571 -0.0087441 0.0632594 -0.0130141 0.0468563 0.048353 -0.0009249 -0.1323301 0.0011036 0.0306868 0.019977 -0.0603069 0.0200036 -0.0995026 0.0896887 -0.0623895 -0.0232879 -0.0337555 -0.0717736 -0.0783283 0.0067594 -0.1146497 0.0047348 -0.0918196 0.0807475 -0.0653621 0.0140778 0.0623353 0.057414 -0.0712542 0.0918465 -0.0342532 unknown
polarizability: 128.2751613|-0.5794337|92.9812406|-14.2118212|0.4273192|88.1194853 unknown
InChI: InChI=1S/C9H12N2O/c10-5-11-8-4-6-1-2-9(12-11)7(8)3-6/h6-9H,1-4H2
charge 0 multiplicity 1
24 atoms
O  -0.806696 -1.044606 -0.631958
N  -1.483083 0.225598 -0.214002
N  -3.670621 -0.172927 1.057973
C  0.513996 0.054681 1.162814
C  1.931825 0.971523 -0.523258
C  -0.395025 1.058858 0.374021
C  1.928844 0.656082 0.999336
C  0.347999 -1.269821 0.345535
C  0.544234 1.666664 -0.713151
C  2.066148 -0.363962 -1.327228
C  1.56516 -1.599664 -0.527961
C  -2.609438 -0.007848 0.518924
H  0.189899 -0.077167 2.20763
H  2.749646 1.656288 -0.80939
H  -0.859284 1.821416 1.020843
H  2.736426 -0.031236 1.306135
H  2.024553 1.578133 1.602809
H  0.053431 -2.116521 0.991572
H  0.639472 2.756191 -0.555017
H  0.124873 1.507924 -1.72065
H  3.124999 -0.528391 -1.603031
H  1.49966 -0.279132 -2.272088
H  1.307371 -2.426675 -1.21446
H  2.363009 -1.98301 0.138302
