program: Gaussian 09
title: 000289905
version: EM64L-G09RevD.01
frameworkgroup: C1[X(C14H19NO)]
method: RPBEPBE
basis: SDD
operation: Freq
keyword: #p
keyword: freq=noraman
keyword: PBEPBE/SDD
title: #p freq=noraman PBEPBE/SDD
converged: YES YES NO NO
title: Mulliken charges:
elementType: O N C C C C C C C C C C C C C C H H H H H H H H H H H H H H H H H H H
charge: -0.226375 -0.075452 -0.151399 -0.175227 -0.201444 -0.436949 -0.426482 -0.390346 -0.368615 0.475202 -0.623357 -0.398489 -0.421120 -0.253033 -0.237325 -0.242965 0.214374 0.235159 0.211079 0.231256 0.201048 0.212615 0.222614 0.197753 0.207492 0.226429 0.190243 0.250355 0.216760 0.201541 0.225997 0.232933 0.222629 0.224616 0.228483
chargesum: 0.00000
title: Mulliken charges with hydrogens summed into heavy atoms:
elementType: O N C C C C C C C C C C C C C C
charge: -0.226375 -0.075452 0.062975 0.059932 0.009636 -0.004645 0.008747 0.014899 0.048057 0.475202 0.045299 -0.172492 -0.188187 -0.030404 -0.012709 -0.014482
polarizability: 1.91205109e+02 4.89625537e+00 1.23662180e+02 3.14400913e-02 1.16133916e+01 1.42537636e+02
1716.lowfreq: -8.3058 -0.0005 -0.0003 0.0007 7.3903 21.9069 28.6731 41.7636 66.1521
frequency: 27.1899 41.6044 66.1064 112.9630 133.3497 165.0365 213.4612 240.7115 256.1110 266.8152 306.8575 339.0832 366.1312 403.2625 404.5235 420.9908 472.9907 523.8242 591.4579 608.0715 617.1027 684.1076 697.2003 704.7468 714.6472 743.4734 777.0285 797.5040 847.2645 857.6522 863.8313 881.9499 895.4064 913.3083 933.7379 960.0500 972.2342 982.5425 990.7779 993.1512 1028.4258 1034.8397 1051.2175 1066.9098 1076.1902 1082.5030 1092.1530 1114.6953 1132.6711 1138.9456 1149.7066 1172.0466 1179.5118 1190.3138 1200.1193 1209.3183 1235.8691 1267.0987 1271.5252 1296.0037 1317.3219 1322.9474 1326.4699 1336.5385 1344.5231 1354.6434 1357.5476 1367.9964 1384.8096 1411.8570 1437.9126 1446.1746 1457.8346 1468.4117 1472.3791 1474.5464 1478.7639 1484.6620 1589.8406 1613.3437 2883.5018 2918.7629 2952.6989 2970.1457 2974.9265 2983.4002 2993.0105 3018.7496 3035.2647 3042.1241 3047.2066 3055.3588 3057.4140 3103.5664 3110.3686 3123.7637 3137.1933 3152.1109 3164.5348
redmass: 3.7897 4.0173 3.8135 3.4673 3.7307 2.5937 3.0030 1.1750 3.2816 2.8754 2.6735 2.6714 2.2807 2.8177 3.5222 3.9644 2.1665 3.4365 4.2064 4.6927 5.9794 2.7075 4.1149 1.6166 5.4557 2.9121 2.2645 2.6721 1.2684 2.6922 2.5600 1.7638 3.1020 1.5660 2.5346 2.5396 1.3931 1.9316 5.5807 1.3291 2.2768 2.1461 2.3133 1.9197 1.8157 1.6139 1.4744 1.3569 1.2183 1.9246 1.7779 1.0617 2.1764 1.1801 1.5674 1.7100 1.5566 1.4349 1.3666 1.3963 1.3113 1.3258 1.3236 1.4368 1.4084 1.4107 1.5249 1.5589 4.5209 1.1623 2.1781 1.0482 1.0879 1.0876 1.0944 1.0579 1.0873 2.2130 5.9382 6.1013 1.0825 1.0462 1.0656 1.0802 1.0607 1.0619 1.0642 1.0869 1.0974 1.0864 1.1021 1.1024 1.0991 1.0986 1.0873 1.0859 1.0923 1.0943 1.1002
irintensity: 0.7831 4.8314 0.2746 1.9116 3.1888 0.5837 0.2850 1.1022 1.1717 2.6673 3.9867 3.2746 1.8487 0.0156 1.2399 0.9383 0.3039 12.7320 6.8631 1.5081 1.2171 4.0957 2.4324 52.7915 9.0114 21.8873 22.8613 3.3801 0.5818 0.9805 2.6624 7.2889 12.9368 6.7136 10.6276 1.8020 0.3324 7.0068 0.2390 0.0878 10.3821 6.7875 9.9805 10.2453 1.5885 5.1575 4.4975 1.3901 1.6786 0.0961 3.5369 0.0917 2.5771 3.1333 1.3677 3.5960 5.2679 1.7964 0.4666 5.0155 8.1549 2.6234 2.0233 0.2234 2.1537 1.6316 2.2162 0.6805 1.2367 6.8985 7.1874 12.6056 9.5525 8.7590 6.0060 9.5196 11.5879 24.6037 2.1509 10.2759 50.0286 70.2525 92.4672 21.7159 25.9960 38.2062 30.5276 27.8632 39.9404 33.9232 25.4302 65.5106 38.9552 22.2900 9.4166 0.0880 24.2722 45.3502 15.2957
temp: 298.150 k
press: 1.00000 atm
elementType: 8 7 6 6 6 6 6 6 6 6 6 6 6 6 6 6 1 1 1 1 1 1 1 1 1 1 1 1 1 1 1 1 1 1 1
symmnumber: 1
zpe: 789241.9 jmol-1
zpe.correction: 0.300606 hartree
zpe.thermalcorrener: 0.314796 hartree
zpe.thermalcorrenthalpy: 0.315741 hartree
zpe.thermalcorrgfe: 0.258891 hartree
zpe.sumelectzpe: -673.592926 hartree
zpe.sumelectthermal: -673.578736 hartree
zpe.sumelectthermalent: -673.577792 hartree
zpe.sumelectthermalfe: -673.634641 hartree
dipole: -1.8988 0.2273 1.1503
dipole: 2.2317
quadrupole: -102.8744 -94.3264 -90.6758
quadrupole: 2.6813 3.7517 3.5099
quadrupole: -6.9156 1.6325 5.2831 2.6813 3.7517 3.5099
hfenergy: -673.8935322 hartree
pointgroup: C01[X(C14H19N1O1)]
dipole: -0.7461049 -0.1192237 -0.4472643 debye
polarizability: 191.4298719|-2.8664218|123.8494003|-0.5368333|11.9502379|142.1256527 unknown
InChI: InChI=1S/C14H19NO/c1-15-14-12(10-16-15)8-5-9-13(14)11-6-3-2-4-7-11/h2-4,6-7,12-14H,5,8-10H2,1H3
charge 0 multiplicity 1
35 atoms
O  3.539285 0.605194 -0.347941
N  2.300884 1.113983 0.42626
C  1.107855 0.474119 -0.242117
C  1.690389 -0.841023 -0.83862
C  -0.028571 0.332384 0.809689
C  1.871605 -1.96598 0.207397
C  0.269926 -0.837139 1.801195
C  0.604771 -2.154067 1.070526
C  3.036205 -0.327595 -1.384325
C  -1.43914 0.225061 0.216936
C  2.331738 2.588665 0.272833
C  -1.717757 -0.215388 -1.102298
C  -2.541253 0.570497 1.046154
C  -3.04825 -0.312391 -1.57409
C  -3.870154 0.473937 0.583098
C  -4.130995 0.028356 -0.734433
H  0.75106 1.112715 -1.087056
H  1.050312 -1.204943 -1.663438
H  -0.013632 1.264508 1.411755
H  2.723016 -1.706336 0.865703
H  2.131227 -2.907951 -0.31416
H  -0.598248 -0.972685 2.472978
H  1.137091 -0.543385 2.423759
H  0.768781 -2.961143 1.809723
H  -0.250224 -2.466429 0.436988
H  3.796365 -1.122172 -1.484547
H  2.910819 0.196918 -2.355043
H  3.269968 2.970473 0.704908
H  1.486126 3.008389 0.848947
H  2.253211 2.92414 -0.785868
H  -0.899937 -0.481323 -1.778859
H  -2.34985 0.924972 2.067474
H  -3.237006 -0.654536 -2.598313
H  -4.699993 0.750112 1.243688
H  -5.161123 -0.046436 -1.100201
