program: Gaussian 09
title: 000289904
version: EM64L-G09RevD.01
frameworkgroup: C1[X(C18H25NO)]
method: RPBEPBE
basis: SDD
operation: Freq
keyword: #p
keyword: freq=noraman
keyword: PBEPBE/SDD
title: #p freq=noraman PBEPBE/SDD
converged: YES YES NO NO
title: Mulliken charges:
elementType: O N C C C C C C C C C C C C C C C C C C H H H H H H H H H H H H H H H H H H H H H H H H H
charge: -0.257657 -0.092505 -0.107862 -0.091340 -0.282151 -0.458098 -0.437833 0.494055 -0.483456 -0.333714 -0.471294 -0.156563 -0.183424 -0.380230 -0.451707 -0.394211 -0.689243 -0.230259 -0.233685 -0.244316 0.231713 0.239245 0.230765 0.221425 0.210228 0.230708 0.211974 0.201827 0.206522 0.196511 0.216450 0.204543 0.205999 0.212287 0.214325 0.204940 0.230501 0.236528 0.266552 0.209558 0.206151 0.219295 0.224678 0.224348 0.228422
chargesum: 0.00000
title: Mulliken charges with hydrogens summed into heavy atoms:
elementType: O N C C C C C C C C C C C C C C C C C C
charge: -0.257657 -0.092505 0.123851 0.147905 -0.051386 -0.026445 0.004849 0.494055 -0.075107 0.079247 -0.060752 0.055724 0.030901 0.055210 -0.215179 -0.127659 -0.054239 -0.005581 -0.009337 -0.015895
polarizability: 2.13538913e+02 2.43911586e+01 2.05298300e+02 -4.42474630e+00 1.13499464e+01 1.73759637e+02
1716.lowfreq: -4.5561 -0.0009 -0.0008 -0.0004 4.7170 11.7540 35.4251 43.6256 50.3615
frequency: 35.2374 43.4835 50.3510 55.3037 69.9130 70.3397 118.1954 155.2035 172.3212 193.4602 210.9767 228.3734 242.6547 246.2356 274.8262 285.8725 309.1706 322.6790 350.0659 394.8128 405.0407 437.4137 465.0888 477.5853 528.1669 560.4962 583.8173 593.8558 617.0721 629.7407 661.6976 706.9013 728.8401 742.0108 759.4143 769.9430 792.1204 825.8746 843.2657 856.8654 863.9230 877.0953 884.1474 899.4429 917.6335 935.1610 945.2838 960.9240 972.0971 979.1304 989.8063 990.4382 996.8299 1006.4590 1025.0489 1036.7530 1055.6515 1057.1926 1076.4911 1092.8587 1097.6865 1111.9045 1124.8298 1126.0221 1136.5320 1164.5499 1171.7662 1183.1047 1189.0506 1198.4129 1212.2569 1233.9630 1242.1328 1252.7907 1259.5374 1273.3601 1283.0307 1291.2692 1295.9373 1301.5741 1307.5147 1310.9210 1321.7365 1332.7808 1340.8126 1350.5238 1356.1754 1368.4157 1385.7020 1388.0218 1389.4643 1439.4237 1442.9671 1460.7307 1463.9386 1467.6255 1475.8609 1479.1962 1481.9233 1484.3528 1486.0169 1591.7917 1613.1086 1662.2815 2891.6809 2907.5202 2964.6429 2971.8902 2974.7737 2982.2495 2989.3274 2991.0684 2999.7948 3017.5200 3022.3422 3027.3942 3036.0550 3037.3071 3048.7752 3059.3876 3074.5170 3077.8576 3079.0941 3112.6441 3115.7939 3124.8244 3137.7850 3149.3173 3163.0711
redmass: 3.7494 3.4267 3.8294 3.6435 3.9467 1.7338 3.0049 4.3637 3.0684 3.9672 2.2023 1.1742 3.1562 3.7287 3.0330 3.0477 2.9800 2.9608 3.0515 3.2389 2.8442 3.8079 2.2186 3.6149 2.7343 2.8940 3.2909 2.4588 6.2087 6.0027 4.3620 1.7663 1.4814 1.3946 1.8654 2.0314 2.2831 2.2971 3.5519 1.2534 2.6258 1.8194 1.4145 1.7431 1.7232 3.0629 2.1288 4.2374 1.3431 1.3907 1.9922 3.9048 1.3402 2.6126 2.2140 2.7256 2.8779 2.8698 1.8973 2.5905 2.4921 2.0557 2.1073 1.7986 1.6376 2.0910 1.0574 1.1104 1.2755 1.3051 2.0221 1.2505 1.2595 1.3265 1.1629 1.1729 1.2505 1.2319 1.2639 1.3184 1.3613 1.2892 1.2510 1.3862 1.4190 1.3891 1.5227 1.5569 4.7577 1.5023 1.2485 1.4017 1.4791 1.0835 1.0898 1.1115 1.0537 1.0424 2.3622 1.0949 1.0789 6.1076 6.1743 6.8161 1.0816 1.0661 1.0593 1.0358 1.0628 1.0603 1.0804 1.0637 1.0614 1.0914 1.0937 1.0935 1.0994 1.0989 1.0996 1.1025 1.0989 1.1022 1.0852 1.0983 1.0868 1.0865 1.0917 1.0956 1.1014
irintensity: 0.0756 0.1686 0.1179 0.1250 0.4273 0.0259 0.3396 1.6218 0.7195 0.0228 0.1263 0.1605 1.0305 2.2265 1.0094 0.8114 2.1103 2.7104 1.3791 0.4999 0.0841 4.6291 1.4454 3.9177 4.2683 6.0297 3.5558 3.6347 0.7947 9.5391 8.9846 44.5396 76.7349 5.1709 16.6864 4.5755 39.6706 2.2478 2.7576 0.0600 10.8432 12.0501 5.9600 9.2271 0.2767 23.9245 2.3028 27.0669 1.0329 0.0838 2.3599 0.4576 1.3232 0.4588 8.6741 2.0975 4.4022 0.6187 10.5964 3.7573 9.5496 7.9608 3.2379 2.6592 2.5294 1.8503 0.1270 0.5438 5.0153 1.7115 0.1009 1.3035 5.4122 3.0045 1.5734 0.8611 3.2513 0.8569 0.5180 0.5396 3.4144 4.7961 1.2089 4.7148 1.7441 10.3201 6.0036 3.7681 1.1590 1.6931 12.8305 8.2459 3.0398 5.5786 4.1484 4.7392 3.0135 12.3563 18.1810 23.7646 13.5141 1.2166 6.7163 4.1666 24.4030 61.4523 27.9752 46.7868 31.0506 15.9915 13.2890 34.9485 23.1831 10.7877 20.5113 29.6375 56.9880 6.6490 1.1516 49.6126 48.8094 71.8383 15.2331 73.6844 7.1531 0.3633 21.6292 28.4953 23.6580
temp: 298.150 k
press: 1.00000 atm
elementType: 8 7 6 6 6 6 6 6 6 6 6 6 6 6 6 6 6 6 6 6 1 1 1 1 1 1 1 1 1 1 1 1 1 1 1 1 1 1 1 1 1 1 1 1 1
symmnumber: 1
zpe: 1022117.4 jmol-1
zpe.correction: 0.389304 hartree
zpe.thermalcorrener: 0.408338 hartree
zpe.thermalcorrenthalpy: 0.409282 hartree
zpe.thermalcorrgfe: 0.341450 hartree
zpe.sumelectzpe: -829.297757 hartree
zpe.sumelectthermal: -829.278723 hartree
zpe.sumelectthermalent: -829.277779 hartree
zpe.sumelectthermalfe: -829.345611 hartree
dipole: -0.0249 -1.6236 -0.4069
dipole: 1.6740
quadrupole: -118.0162 -121.6985 -115.1988
quadrupole: 4.3250 -0.9319 2.1768
quadrupole: 0.2883 -3.3940 3.1057 4.3250 -0.9319 2.1768
hfenergy: -829.687061 hartree
pointgroup: C01 [X(C18H25N1O1)]
dipole: 0.0691012 -0.6388079 0.1446426 debye
polarizability: 218.4497201|-22.6904204|201.188462|-2.6608076|-11.6120391|172.9586671 unknown
InChI: InChI=1S/C18H25NO/c1-2-14-19-18(15-10-6-5-7-11-15)16-12-8-3-4-9-13-17(16)20-19/h3-7,10-11,16-18H,2,8-9,12-14H2,1H3
charge 0 multiplicity 1
45 atoms
O  -0.702265 2.05779 0.483907
N  0.605887 1.385374 0.04102
C  -1.007963 -0.346803 0.217105
C  -1.74285 1.031311 0.196104
C  0.439357 0.026659 0.667784
C  -1.662837 -1.430541 1.10267
C  -2.466293 1.354427 -1.126753
C  1.510637 -0.942296 0.197387
C  -2.971111 -2.042029 0.511237
C  1.674505 2.21141 0.659636
C  -3.49699 0.256986 -1.538581
C  -4.179857 -1.114009 0.506526
C  -4.425058 -0.125645 -0.398836
C  1.796162 3.584937 -0.025109
C  2.142451 -1.814574 1.117567
C  1.87574 -1.00795 -1.173216
C  2.934281 4.433248 0.581097
C  3.112713 -2.745463 0.679788
C  2.849736 -1.930822 -1.610527
C  3.469094 -2.806558 -0.68654
H  -0.935514 -0.732123 -0.819292
H  -2.446832 1.109261 1.044015
H  0.459288 0.104827 1.78179
H  -0.934837 -2.256195 1.238928
H  -1.867746 -1.013914 2.109791
H  -1.708334 1.47195 -1.924736
H  -2.978018 2.329372 -1.013748
H  -3.221765 -2.94765 1.095597
H  -2.750005 -2.386793 -0.519227
H  1.491199 2.337482 1.752605
H  2.614885 1.639729 0.532602
H  -2.947078 -0.637573 -1.890007
H  -4.083068 0.627934 -2.400591
H  -4.904832 -1.26068 1.320713
H  -5.331115 0.485642 -0.274141
H  1.969984 3.425494 -1.106459
H  0.830363 4.113587 0.069219
H  1.8769 -1.761259 2.180891
H  1.40362 -0.315532 -1.878857
H  2.764354 4.619506 1.658573
H  3.913026 3.927015 0.476943
H  3.008038 5.414631 0.07853
H  3.592347 -3.415633 1.402209
H  3.129093 -1.96868 -2.669757
H  4.223905 -3.524145 -1.027552
