program: Gaussian 09
title: 000289903
version: EM64L-G09RevD.01
frameworkgroup: C1[X(C9H14N2O)]
method: RPBEPBE
basis: SDD
operation: Freq
keyword: #p
keyword: freq=noraman
keyword: PBEPBE/SDD
title: #p freq=noraman PBEPBE/SDD
converged: NO YES NO NO
title: Mulliken charges:
elementType: O N N C C C C C C C C C H H H H H H H H H H H H H H
charge: -0.187600 -0.072872 -0.057215 -0.175868 -0.115841 -0.450417 0.008776 -0.444271 -0.416991 -0.360294 -0.739987 -0.079507 0.246983 0.252749 0.229905 0.199077 0.230635 0.207187 0.236414 0.205717 0.188036 0.213240 0.239764 0.220109 0.218610 0.203662
chargesum: 0.00000
title: Mulliken charges with hydrogens summed into heavy atoms:
elementType: O N N C C C C C C C C C
charge: -0.187600 -0.072872 -0.057215 0.071116 0.136909 -0.021436 0.239411 -0.000670 -0.023238 0.092710 -0.097606 -0.079507
polarizability: 1.18468923e+02 9.70822018e+00 1.22100309e+02 -7.82032121e-01 3.71907405e-01 8.31832879e+01
1716.lowfreq: -13.5180 -4.6396 -0.0003 -0.0002 0.0006 12.6859 35.8644 88.1660 121.4622
frequency: 35.4231 88.1161 121.4494 168.7419 210.8088 212.9848 243.0849 275.8681 302.9598 349.7226 359.5831 418.7885 483.5379 495.3566 530.5877 576.8787 632.6397 682.7371 698.6946 762.7747 811.0908 847.7755 866.4629 880.6550 908.6673 945.2246 953.7392 968.8489 1008.9438 1042.2154 1052.7734 1089.2782 1096.2814 1119.3000 1131.2025 1152.7521 1192.6959 1211.3847 1220.3090 1235.0555 1268.2325 1278.0229 1305.5522 1310.4231 1322.5982 1330.0083 1331.5584 1350.0672 1363.1152 1373.5717 1392.5598 1453.6924 1465.4282 1468.9356 1475.2154 1477.6287 1478.1273 2142.3990 2953.7471 2954.5737 2967.9269 2973.4210 2983.0142 2983.8985 2987.0240 3023.7739 3028.2616 3034.5578 3051.5914 3062.2569 3070.3444 3085.3426
redmass: 6.2078 3.5898 3.9110 4.5944 1.4078 2.3910 2.1771 2.2686 3.5069 2.1314 4.3850 1.7363 5.8159 3.9054 7.2752 5.9662 4.4783 3.4392 4.3753 2.6816 2.1570 2.4316 2.2042 3.6728 2.1059 1.9448 1.6532 1.4329 2.3095 1.6157 2.1094 1.4034 1.8608 2.0237 1.5156 2.3606 2.6715 1.4771 1.7810 1.5894 1.3295 1.4413 1.3197 1.2864 1.3542 1.3384 1.4075 1.5578 1.4663 1.4767 1.2237 1.0836 1.0858 1.0890 1.0914 1.0465 1.0586 12.5160 1.0792 1.0646 1.0372 1.0719 1.0636 1.0709 1.0669 1.0902 1.0953 1.0995 1.1007 1.0987 1.0993 1.1024
irintensity: 0.3727 3.8001 1.5391 6.2816 1.5842 3.5095 1.6142 0.4491 0.4424 1.0010 0.2573 0.5742 1.9560 1.7099 4.2786 1.0910 4.3243 4.6596 6.3743 0.5090 3.0500 4.0758 2.5297 14.2039 18.5899 0.1111 1.9729 2.4790 7.2693 11.2910 5.6796 0.8287 0.9576 2.1431 2.5611 6.2691 5.8133 4.1251 1.1969 2.3531 4.4408 1.9896 5.0573 12.7313 0.4497 3.9653 5.9786 1.2159 5.7964 1.7230 12.1402 4.6785 16.3187 4.4267 6.5173 15.7626 10.6768 96.7457 11.9735 27.0144 37.8392 24.0402 52.5529 50.7448 24.3357 37.0548 25.8596 9.7375 46.3989 69.4034 38.0659 16.0242
temp: 298.150 k
press: 1.00000 atm
elementType: 8 7 7 6 6 6 6 6 6 6 6 6 1 1 1 1 1 1 1 1 1 1 1 1 1 1
symmnumber: 1
zpe: 574998.6 jmol-1
zpe.correction: 0.219005 hartree
zpe.thermalcorrener: 0.230390 hartree
zpe.thermalcorrenthalpy: 0.231334 hartree
zpe.thermalcorrgfe: 0.181653 hartree
zpe.sumelectzpe: -535.069983 hartree
zpe.sumelectthermal: -535.058599 hartree
zpe.sumelectthermalent: -535.057655 hartree
zpe.sumelectthermalfe: -535.107336 hartree
dipole: -4.3510 -4.0765 2.5364
dipole: 6.4794
quadrupole: -84.9197 -75.3849 -71.1939
quadrupole: -11.2479 4.1120 -0.7409
quadrupole: -7.7535 1.7813 5.9723 -11.2479 4.1120 -0.7409
hfenergy: -535.2889884 hartree
pointgroup: C01 [X(C9H14N2O1)]
dipole: 1.9203885 1.425375 0.88245 debye
dipolederiv: -0.4290514 0.0346731 -0.0962872 -0.1029106 -0.4820782 -0.0410511 -0.0277937 -0.1996038 -0.1993756 -0.472497 -0.4589373 0.0275592 -0.2284246 0.0893124 -0.1434504 0.1157224 0.0648696 -0.1703503 -0.4150544 -0.0955124 0.0102761 -0.2018936 -0.3618738 0.0021023 -0.0056601 -0.0148855 -0.2481235 0.0113943 0.0689648 -0.0113814 0.1146166 0.0366492 0.0585685 -0.0839363 0.014853 0.1085806 0.4257085 0.0891491 0.0623276 -0.0329928 0.0038555 0.0824192 0.186469 0.0764051 0.3678313 0.0710469 0.015093 0.0631401 0.0358893 0.0279721 0.0104476 -0.0014424 0.0064442 0.0837094 0.0573158 0.033966 0.0021551 0.0345486 0.0722335 0.0194487 -0.0414242 0.0399307 0.104128 0.0439501 0.0408561 0.0367387 0.0746205 0.0443427 0.0256039 -0.0239053 -0.0166863 0.0666293 0.0665796 0.0440697 0.0303676 0.0149526 -0.000969 0.0138295 0.0845018 0.0176787 0.1517783 0.269985 0.0889967 -0.0105125 -0.0213744 0.3418057 0.0676155 -0.0188091 0.275107 0.3277924 0.0118619 0.0485346 0.0176643 0.0550394 -0.0045405 0.0146219 0.0524675 -0.0091342 0.0940629 0.4837027 0.3757538 -0.1201927 0.5951989 0.3169207 0.0005847 -0.1325641 0.0084684 0.0032315 0.0182634 -0.0643405 -0.0558765 -0.0581828 0.0471513 -0.0580382 -0.0285168 -0.0737638 -0.0919925 -0.1050839 0.0040979 0.1070059 -0.0049166 0.0332058 -0.0057621 0.0049001 -0.0384233 -0.1439024 0.0265445 -0.0749994 0.0288357 -0.0664461 -0.1192694 0.0375314 0.0326603 -0.0049217 0.0728318 -0.0394586 0.0210757 -0.1161004 0.0024634 0.0740213 -0.0473377 -0.0599725 -0.0176136 -0.1017673 0.0071453 -0.022909 -0.0970341 -0.0185474 0.0328708 0.0017875 -0.086579 -0.0185541 -0.0901609 0.0135566 -0.0564684 0.0240103 -0.0630988 -0.2029037 0.0244444 0.0197694 -0.0007177 0.0716529 0.0315004 0.0251843 -0.0877211 -0.0082619 0.0732864 -0.0506489 -0.0557061 -0.0175375 -0.069109 -0.0957676 -0.0258633 0.1243326 -0.0015379 0.0528098 0.009711 0.161534 0.03335 -0.0601035 0.0038341 -0.0130297 -0.0843493 -0.0002979 0.0234237 -0.0141842 -0.1582072 -0.0490513 -0.1150782 -0.081205 0.0282625 0.0986522 -0.0145547 0.0072592 -0.0266525 0.1002851 -0.1453887 -0.1093435 0.0985701 -0.0489355 0.012236 -0.0275434 -0.0904375 0.0435674 -0.033172 0.0628645 0.0220134 0.0481029 -0.1011117 -0.002529 -0.0288046 -0.1645519 0.0041507 -0.0084716 0.0206311 0.093867 -0.0578776 0.0298682 0.1168012 -0.0149287 0.0821721 0.039874 0.1522041 -0.002376 -0.0661048 0.0069333 0.0135614 -0.0801186 -0.0326125 0.0673318 -0.0691833 -0.1443533 -0.011945 -0.1026971 unknown
polarizability: 120.8681993|9.8196299|119.574596|-0.7511734|-2.3595404|83.3097253 unknown
InChI: InChI=1S/C9H14N2O/c1-7-2-3-8-5-12-11(6-10)9(8)4-7/h7-9H,2-5H2,1H3
charge 0 multiplicity 1
26 atoms
O  -1.751678 1.136341 -0.753841
N  -1.235731 -0.2109 -0.235468
N  -3.081043 -1.957267 -0.008163
C  0.193463 1.506681 0.595243
C  -0.240262 0.038972 0.872659
C  0.894906 -1.004526 0.855349
C  1.878296 -0.840238 -0.326159
C  1.255916 1.625998 -0.524764
C  2.410128 0.613399 -0.357715
C  -1.152648 2.13204 0.179054
C  3.023276 -1.869959 -0.229293
C  -2.240335 -1.098335 -0.071584
H  0.570697 1.954927 1.533244
H  -0.766151 -0.005868 1.850019
H  0.456313 -2.021293 0.859282
H  1.453157 -0.898047 1.809061
H  1.31577 -1.017352 -1.26596
H  1.649328 2.660925 -0.53756
H  0.763464 1.450891 -1.500818
H  3.130451 0.732165 -1.190055
H  2.969623 0.817425 0.580441
H  -1.823342 2.298083 1.045582
H  -1.049462 3.05623 -0.413634
H  2.634687 -2.9054 -0.215333
H  3.713556 -1.780493 -1.088462
H  3.614224 -1.718196 0.695074
