program: Gaussian 09
title: 000289902
version: EM64L-G09RevD.01
frameworkgroup: C1[X(C8H12O)]
method: RPBEPBE
basis: SDD
operation: Freq
keyword: #pfreq=noraman
keyword: PBEPBE/SDD
title: #p freq=noraman PBEPBE/SDD
converged: YES YES NO NO
title: Mulliken charges:
elementType: O C C C C C C C C H H H H H H H H H H H H
charge: -0.444547 -0.200541 0.085416 -0.587291 0.040511 -0.522533 -0.516665 -0.407229 -0.319662 0.241922 0.244847 0.247145 0.242536 0.243560 0.243380 0.242785 0.201625 0.219661 0.217223 0.180105 0.347751
chargesum: 0.00000
title: Mulliken charges with hydrogens summed into heavy atoms:
elementType: O C C C C C C C C
charge: -0.096797 0.041381 0.085416 -0.095298 0.040511 -0.036437 -0.030500 0.014057 0.077667
polarizability: 1.24053170e+02 -3.76932093e+00 8.43326297e+01 -4.50432548e+00 -2.11134741e+00 6.44855856e+01
1716.lowfreq: -9.2918 -0.0006 0.0001 0.0007 4.4184 17.4904 47.7883 72.8660 104.8205
frequency: 47.6280 72.8386 104.8118 153.6672 184.9524 231.5064 263.5134 338.0926 371.7992 395.0580 444.2454 505.2956 595.2598 744.9941 755.7605 809.4649 832.7850 854.7145 910.2835 943.1004 960.4387 977.5986 991.3912 1019.4349 1023.3381 1038.2942 1058.3346 1065.2604 1074.4870 1085.5124 1117.1282 1127.0817 1180.8432 1209.1887 1242.4875 1304.0126 1320.7553 1362.9440 1380.3006 1425.3523 1428.2767 1442.9123 1450.8275 1472.9850 1919.0389 2939.5158 2982.8300 3042.6006 3059.0916 3063.4786 3069.3745 3074.0714 3075.1248 3157.7539 3160.7604 3176.3358 3553.0898
redmass: 4.6237 4.0457 2.9264 2.9963 2.4383 2.2734 2.3833 1.7414 2.3698 1.8395 2.4821 3.9687 3.2360 1.0335 2.4525 1.4235 1.8019 2.0073 1.6700 2.3224 3.4828 1.3560 5.3815 1.5227 2.3284 1.2685 1.4579 1.4205 2.0564 1.5962 1.5292 1.2639 1.4332 1.2959 1.6640 1.4987 1.2225 1.7473 1.2233 1.0827 1.1309 1.0933 1.3350 1.0864 11.3019 1.0702 1.0612 1.0959 1.0565 1.0892 1.0505 1.0937 1.0617 1.1144 1.1154 1.1138 1.0657
irintensity: 1.7794 0.3767 3.2566 0.8371 4.7556 7.3086 17.3060 68.7509 55.3351 76.5073 4.0922 1.6762 0.5776 5.1412 10.7526 1.5134 5.1137 7.0200 22.9454 19.9423 44.4690 7.9650 9.3401 8.0374 53.3713 4.4397 0.1251 10.5733 7.3489 0.3071 3.7256 0.0359 14.1196 2.2584 5.6296 2.3620 9.7568 6.2080 22.0678 6.9296 5.0747 13.8170 2.3643 3.1607 0.4762 76.8751 25.9073 12.4903 21.7085 32.7272 20.3548 49.3635 22.1061 12.8479 0.0450 25.1948 2.3057
temp: 298.150 k
press: 1.00000 atm
elementType: 8 6 6 6 6 6 6 6 6 1 1 1 1 1 1 1 1 1 1 1 1
symmnumber: 1
zpe: 464103.4 jmol-1
zpe.correction: 0.176768 hartree
zpe.thermalcorrener: 0.186826 hartree
zpe.thermalcorrenthalpy: 0.187770 hartree
zpe.thermalcorrgfe: 0.141029 hartree
zpe.sumelectzpe: -386.443341 hartree
zpe.sumelectthermal: -386.433283 hartree
zpe.sumelectthermalent: -386.432339 hartree
zpe.sumelectthermalfe: -386.479080 hartree
dipole: 2.0377 -0.6200 1.1140
dipole: 2.4036
quadrupole: -64.3661 -51.3420 -53.5040
quadrupole: 2.5525 -3.9638 1.3788
quadrupole: -7.9620 5.0620 2.9000 2.5525 -3.9638 1.3788
hfenergy: -386.6201086 hartree
pointgroup: C01 [X(C8H12O1)]
dipole: -0.7950283 -0.2630179 -0.4393338 debye
dipolederiv: -0.5814813 -0.1634168 0.1657083 -0.2549173 -0.6573978 -0.1170478 0.206232 -0.085055 -0.4015583 -0.0563716 0.1442071 0.0532835 0.1559814 0.0199831 -0.0575862 0.0740733 -0.0573847 0.1591678 -0.0930529 -0.0466981 -0.0377477 -0.0486518 0.2455377 0.1080713 -0.0928264 0.1405345 -0.1010864 -0.0187271 -0.0679056 0.0227913 -0.1119131 -0.2626602 -0.0702906 -0.000673 -0.0936927 0.1063769 0.004282 -0.0668053 -0.0682764 -0.0491695 0.2612436 0.1466571 -0.0474244 0.1335593 -0.1146568 0.0387278 -0.0549369 0.0211769 -0.1212047 -0.216407 -0.0856971 -0.0095256 -0.0910838 0.1384105 -0.0924812 0.0984028 0.0824089 0.1744221 -0.0921873 -0.1022999 0.1141589 -0.0968947 0.1230355 -0.0871414 -0.068776 0.0297338 -0.0954516 0.0609337 0.0302257 0.1417155 -0.0284312 0.0551198 0.3888821 0.0880881 -0.0329657 0.1573973 0.5707829 0.1085856 -0.1341391 0.0715231 0.3748601 -0.0047475 0.0409696 0.0524998 0.0589878 0.0382251 -0.0260612 0.0570693 -0.0061055 -0.1221879 0.055764 -0.0245196 -0.021914 -0.0432519 -0.0718817 0.0815981 0.0186289 0.1027548 0.0053043 0.0321328 -0.0724752 -0.0531683 -0.0548468 0.0349756 -0.0191936 -0.0839571 -0.0509381 -0.0486667 0.030746 -0.0615583 -0.0466615 -0.0573009 0.0244615 -0.0449738 -0.0879543 -0.0709349 -0.0600254 0.0606394 -0.0233136 -0.0259192 -0.0543425 -0.0612341 0.0753487 0.0180297 0.1010746 0.0026521 0.0120498 0.0397183 0.0332127 0.0266622 0.0781602 -0.0320786 0.0908226 -0.0381594 -0.0935674 -0.0383922 0.0843218 -0.023291 0.0980337 0.0196844 0.0535441 -0.0695566 0.0608201 0.0163228 0.0114336 -0.0530579 -0.0155964 -0.0000776 -0.1795671 -0.0221585 -0.0361545 -0.0298177 0.0809196 0.0335461 0.022174 0.0502141 0.0325969 0.0759752 -0.065026 0.0334633 -0.0010612 -0.1230682 -0.0736886 0.0877621 -0.067707 0.072114 -0.0458597 0.0500083 -0.1001047 0.0994879 0.0138478 0.0223161 -0.0298116 0.0235087 -0.0303744 -0.0255546 -0.0629927 0.0941742 -0.1176803 -0.2187596 0.3555641 0.1276312 -0.141291 0.1453067 0.1827864 0.0513672 -0.1860522 0.0574848 0.2075596 unknown
polarizability: 123.9722525|4.3390406|84.5187718|-4.2480328|1.7835463|64.3803614 unknown
InChI: InChI=1S/C8H12O/c9-4-3-7-5-8(7)6-1-2-6/h7,9H,1-5H2
charge 0 multiplicity 1
21 atoms
O  3.512189 0.591038 0.380171
C  0.665793 -0.034083 -0.595762
C  -0.719651 0.356058 -0.194638
C  0.313874 1.436094 -0.121942
C  -1.983673 -0.008208 -0.013802
C  -3.022838 -1.084478 -0.079634
C  -3.371588 0.370868 0.397929
C  1.528119 -0.943336 0.283505
C  3.037192 -0.755111 0.022317
H  0.852218 -0.147376 -1.67519
H  0.297486 2.236923 -0.871862
H  0.675413 1.747614 0.866527
H  -3.397728 -1.40269 -1.059481
H  -3.013734 -1.879173 0.675506
H  -3.58816 0.519796 1.462215
H  -3.97199 0.997275 -0.272151
H  1.260497 -2.001882 0.0898
H  1.311991 -0.740178 1.34975
H  3.630044 -1.435691 0.656011
H  3.267208 -0.979344 -1.043356
H  2.942338 1.250183 -0.092512
