program: Gaussian 09
title: 000289901
version: EM64L-G09RevD.01
frameworkgroup: C1[X(C15H23N)]
method: RPBEPBE
basis: SDD
operation: Freq
keyword: #pfreq=noraman
keyword: PBEPBE/SDD
title: #p freq=noraman PBEPBE/SDD
converged: YES YES NO NO
title: Mulliken charges:
elementType: N C C C C C C C C C C C C C C C H H H H H H H H H H H H H H H H H H H H H H H
charge: -0.299265 -0.047684 -0.442058 -0.411308 -0.391616 -0.392037 -0.384487 -0.364019 -0.394836 -0.552784 0.506141 -0.421704 -0.404664 -0.227329 -0.230654 -0.244712 0.196790 0.176729 0.221766 0.206470 0.177564 0.197171 0.191418 0.189398 0.196079 0.197638 0.187016 0.229327 0.173798 0.201822 0.230976 0.196456 0.200378 0.200891 0.230037 0.231248 0.221894 0.222156 0.225992
chargesum: 0.00000
title: Mulliken charges with hydrogens summed into heavy atoms:
elementType: N C C C C C C C C C C C C C C C
charge: -0.069938 0.149105 -0.043563 -0.027274 -0.003027 -0.006559 0.000167 0.011601 0.032596 -0.151515 0.506141 -0.191666 -0.173416 -0.005434 -0.008498 -0.018720
polarizability: 2.18549014e+02 9.67748279e+00 1.44568350e+02 -1.41264000e+01 1.22315330e+01 1.30349256e+02
1716.lowfreq: -7.0967 -0.0010 -0.0009 -0.0003 4.3949 8.4530 17.9132 29.4806 42.2946
frequency: 16.4185 29.1112 41.7211 54.2750 88.1925 102.5579 114.1794 173.1738 192.5315 224.6291 240.8418 319.9449 324.9921 337.6999 384.7674 403.2079 432.4934 452.5762 460.0377 504.4532 568.7947 580.2946 617.9216 640.3129 705.0555 759.1549 760.1240 780.4093 789.8364 809.7904 842.3723 850.3041 858.6735 881.2885 892.9766 914.8999 917.5088 959.6353 974.1070 989.8331 991.6110 1017.6887 1027.1430 1036.5866 1043.5032 1048.2807 1057.5627 1065.9752 1072.8817 1099.4618 1113.2869 1127.9032 1144.4248 1171.1176 1176.2494 1186.6894 1190.5169 1216.7875 1235.3346 1249.7065 1254.4762 1258.8834 1264.1571 1280.7402 1303.4703 1306.4027 1325.6418 1327.2522 1330.9693 1333.5036 1338.6980 1340.7316 1356.0123 1380.0052 1382.4348 1440.0949 1452.7640 1458.5666 1463.6865 1464.8773 1467.5530 1470.5489 1477.4600 1479.6788 1483.8556 1493.4191 1593.0610 1614.2009 2850.1490 2946.2644 2949.8603 2962.7036 2963.5240 2964.8173 2966.2109 2970.2076 2977.0368 2990.5717 3021.4765 3022.3059 3024.8231 3027.6208 3036.8042 3046.5567 3056.1205 3112.2015 3113.8965 3129.8599 3141.2216 3160.4852 3417.2700
redmass: 3.2965 3.8203 4.2232 3.1827 4.1462 1.8221 2.6003 2.6892 4.6815 1.8229 3.2218 1.8758 2.9452 2.6600 2.8824 2.8180 2.9596 1.8800 3.0935 2.7069 2.3445 3.9373 6.3579 1.4567 1.7249 1.5327 1.2974 1.6771 1.9050 3.6078 2.1249 1.2525 1.2880 1.7295 1.5279 1.4835 1.8320 2.2730 1.3875 6.2907 1.3155 3.1585 2.1486 1.8859 1.8390 1.4327 1.7196 2.2708 1.4918 1.5672 2.5008 1.4835 3.8021 1.0572 1.6805 1.1185 1.5917 2.2811 1.3646 1.2685 1.2934 1.2985 1.3535 1.1107 1.2958 1.2731 1.3831 1.2592 1.3880 1.4116 1.4562 1.4956 1.4493 1.4557 7.7340 2.1849 1.2086 1.0973 1.0884 1.0886 1.0883 1.0826 1.0959 1.1253 2.1745 1.0942 6.0579 6.1839 1.0704 1.0741 1.0647 1.0692 1.0637 1.0634 1.0639 1.0618 1.0665 1.0804 1.0965 1.0994 1.0978 1.0991 1.1010 1.0983 1.1023 1.0868 1.0867 1.0908 1.0958 1.1015 1.0737
irintensity: 0.0372 0.0743 0.0576 0.0838 0.3359 0.9739 0.7510 0.9884 0.1863 0.2896 3.2122 2.3938 0.7445 0.8650 1.3013 0.0019 3.2008 3.1132 4.1717 13.6887 4.7606 2.6204 0.0931 97.9468 54.3918 35.5300 14.4290 1.9754 1.6093 2.0383 5.4932 0.0195 0.1646 7.1704 14.0311 2.0007 0.5287 4.1216 0.0176 0.0164 0.1953 1.6216 4.1856 13.0042 1.5647 0.1291 0.3903 4.3470 2.2084 13.3464 0.8889 32.5927 62.9815 0.0618 2.7459 0.1927 0.1636 0.2303 3.9754 7.6798 2.1967 1.5351 5.1291 0.0806 0.2159 1.6136 5.1243 0.5087 3.3736 0.3958 0.2668 5.2689 15.1591 1.1124 0.1436 6.3740 25.5278 6.2179 4.7606 9.5841 2.9383 23.7646 4.8864 6.1472 19.6990 7.7975 1.3833 13.9724 88.0803 3.9750 18.0815 57.9841 10.4869 36.5167 67.8225 4.5013 34.7228 55.6755 88.6015 4.9757 76.7507 16.6330 72.1345 77.4943 55.7730 10.0297 7.9026 11.4437 49.0321 25.5506 1.6816
temp: 298.150 k
press: 1.00000 atm
elementType: 7 6 6 6 6 6 6 6 6 6 6 6 6 6 6 6 1 1 1 1 1 1 1 1 1 1 1 1 1 1 1 1 1 1 1 1 1 1 1
symmnumber: 1
zpe: 910710.7 jmol-1
zpe.correction: 0.346871 hartree
zpe.thermalcorrener: 0.362795 hartree
zpe.thermalcorrenthalpy: 0.363739 hartree
zpe.thermalcorrgfe: 0.300958 hartree
zpe.sumelectzpe: -638.904765 hartree
zpe.sumelectthermal: -638.888842 hartree
zpe.sumelectthermalent: -638.887897 hartree
zpe.sumelectthermalfe: -638.950678 hartree
dipole: -0.8746 -0.8774 -0.1118
dipole: 1.2439
quadrupole: -96.6008 -98.6972 -96.4122
quadrupole: 2.5654 -2.0969 4.2317
quadrupole: 0.6359 -1.4604 0.8245 2.5654 -2.0969 4.2317
hfenergy: -639.2516362 hartree
pointgroup: C01 [X(C15H23N1)]
dipole: -0.3567693 0.325993 -0.0770831 debye
polarizability: 218.9654327|-1.6113969|150.6274084|15.8357776|5.2114989|123.8737788 unknown
InChI: InChI=1S/C15H23N/c1-3-8-14(9-4-1)10-7-13-16-15-11-5-2-6-12-15/h1,3-4,8-9,15-16H,2,5-7,10-13H2
charge 0 multiplicity 1
39 atoms
N  -1.659121 -0.322965 0.418975
C  -3.068152 -0.436761 -0.031387
C  -3.900116 -1.139754 1.066847
C  -3.739475 0.911588 -0.431509
C  -5.375926 -1.332927 0.643702
C  -5.211732 0.713599 -0.868643
C  -6.032227 0.008311 0.237018
C  -0.66662 0.129207 -0.577893
C  0.766527 -0.020491 -0.028061
C  1.845695 0.447627 -1.043192
C  3.259268 0.288413 -0.502799
C  3.92221 1.365921 0.139697
C  3.932324 -0.958215 -0.592038
C  5.218323 1.204532 0.680762
C  5.22792 -1.125477 -0.053955
C  5.876402 -0.043418 0.586209
H  -3.063248 -1.092299 -0.929483
H  -3.86231 -0.523924 1.992166
H  -3.426546 -2.109849 1.306336
H  -3.162921 1.398616 -1.242241
H  -3.705814 1.593221 0.446124
H  -5.945793 -1.806193 1.466851
H  -5.418654 -2.033042 -0.216649
H  -5.239662 0.097254 -1.791776
H  -5.668358 1.689657 -1.124741
H  -7.072061 -0.161166 -0.104367
H  -6.08885 0.670536 1.126114
H  -1.588391 0.212947 1.296727
H  -0.812301 1.186472 -0.917048
H  -0.782021 -0.507411 -1.479022
H  0.935923 -1.078549 0.245896
H  0.871175 0.567934 0.906969
H  1.727696 -0.138788 -1.976318
H  1.656242 1.507611 -1.304522
H  3.419533 2.338923 0.211764
H  3.437101 -1.801306 -1.090624
H  5.715199 2.050126 1.170423
H  5.73286 -2.094989 -0.136051
H  6.882403 -0.170367 1.001941
