program: Gaussian 09
title: 000289899
version: EM64L-G09RevD.01
frameworkgroup: C1[X(C13H16N4O4)]
method: RPBEPBE
basis: SDD
operation: Freq
keyword: #p
keyword: freq=noraman
keyword: PBEPBE/SDD
title: #p freq=noraman PBEPBE/SDD
converged: YES YES NO NO
title: Mulliken charges:
elementType: O O O O N N N N C C C C C C C C C C C C C H H H H H H H H H H H H H H H H
charge: -0.186348 -0.265766 -0.211334 -0.205570 -0.421607 0.023365 0.025572 0.016114 -0.398977 -0.424122 -0.451140 -0.210831 0.308034 -0.160548 0.264307 -0.295372 -0.497929 0.446360 -0.368615 -0.162659 -0.733332 0.215980 0.203823 0.216579 0.246028 0.209060 0.209612 0.223010 0.224447 0.299499 0.336058 0.346326 0.292864 0.216989 0.226608 0.221252 0.222260
chargesum: 0.00000
title: Mulliken charges with hydrogens summed into heavy atoms:
elementType: O O O O N N N N C C C C C C C C C C C C C
charge: -0.186348 -0.265766 -0.211334 -0.205570 -0.075280 0.023365 0.025572 0.016114 0.020826 0.038485 -0.032468 0.012179 0.308034 0.063899 0.264307 0.004128 -0.161871 0.446360 -0.075750 0.054331 -0.063212
polarizability: 3.33661489e+02 -4.63078681e+01 2.40795090e+02 3.38808383e+01 1.71854659e+01 1.08184942e+02
1716.lowfreq: -7.0976 -5.7088 -0.0005 0.0002 0.0005 1.8605 7.3273 14.0701 36.3404
frequency: 6.9199 13.9350 36.2977 44.3198 55.5472 68.0660 73.8365 75.3947 132.9151 143.7968 161.6751 164.1806 183.4597 193.6215 230.7580 241.1248 258.2995 294.6074 306.3141 322.3433 336.9808 371.5304 400.1702 429.1226 442.7796 467.7820 487.1753 507.3704 515.6543 516.5435 615.3803 652.2451 653.0372 675.1080 706.5710 726.5861 749.3892 754.4493 799.4785 813.5633 823.8638 854.7850 863.6253 864.9857 889.3673 926.7900 939.8911 964.1509 975.7879 995.5817 1011.8625 1026.8221 1044.2436 1045.9986 1057.2711 1067.7318 1101.2396 1104.3132 1127.1096 1137.7913 1167.3749 1178.5438 1201.7050 1214.1900 1229.6925 1250.7528 1280.5156 1294.1744 1296.4476 1309.2742 1325.7045 1334.4035 1340.7896 1346.6248 1363.6989 1394.4104 1399.0058 1447.6438 1448.5742 1458.4407 1461.1847 1464.9961 1472.4126 1476.0788 1518.2776 1577.0509 1599.5237 1625.2226 1689.9757 2965.5493 2965.7825 2970.8404 2977.5986 2985.3950 3023.6581 3040.0976 3040.3066 3065.6364 3069.8905 3070.3930 3090.2331 3179.8362 3189.0265 3199.7756 3222.9289
redmass: 4.8223 4.5031 4.2289 3.6653 9.2693 4.7558 9.1501 2.7654 2.5515 6.2119 6.1032 6.6714 2.0905 1.3938 3.6261 5.2310 3.3559 4.1988 3.0972 5.6791 4.2177 11.7459 3.6114 2.8817 4.1610 2.9206 4.1310 3.2871 5.7270 3.5672 6.0943 6.5402 6.9465 10.7574 7.6296 5.0487 1.4914 10.2884 1.5516 2.8266 1.3999 1.9985 2.1443 1.4177 6.1459 1.7133 1.4838 1.4070 1.0799 2.1650 1.3164 2.9423 1.5443 2.0633 2.0141 3.2094 3.8598 2.4877 1.5537 1.3689 7.8240 1.5144 1.5301 4.0711 1.9123 1.2231 1.2711 1.2831 1.7791 1.3817 1.8192 1.4924 1.4231 3.5353 6.3338 1.2381 3.2014 2.8861 1.3489 1.0949 1.0480 1.0916 1.0613 2.8185 3.8848 5.4083 6.2314 7.1973 6.1411 1.0545 1.0422 1.0656 1.0810 1.0666 1.0999 1.0986 1.0987 1.0936 1.0956 1.0931 1.0940 1.0893 1.0919 1.0964 1.0793
irintensity: 0.1388 0.2111 1.0623 0.2030 0.1112 0.3882 0.0315 0.7942 1.1587 3.3611 6.6569 2.2468 1.9230 1.1849 15.7857 1.3026 0.3479 1.6664 4.7329 3.9128 3.3118 0.5773 3.2519 5.1114 1.3965 1.4994 7.4079 8.9306 1.7516 12.3744 3.8318 8.6454 10.7443 11.4671 7.4290 1.5954 4.9991 8.7320 5.9216 19.7687 85.0429 0.3205 9.8166 22.1808 4.3959 13.0278 20.3063 24.0055 68.2564 1.0755 0.0491 43.6802 0.2549 2.9118 45.2767 50.2385 53.4138 0.3544 3.0879 49.2768 370.9034 15.6380 70.3676 290.7715 162.3059 10.0767 1.2823 1.1352 82.8617 7.1050 48.4656 56.5862 25.3274 137.9037 48.9887 12.3526 24.0952 4.2997 14.3099 15.9109 13.0814 15.1743 8.8872 46.5497 109.0930 86.9096 37.3713 408.1138 1.6538 21.8777 29.1455 37.7971 14.6837 71.2202 18.6933 39.8987 35.6565 16.3588 9.0437 28.1112 79.5199 3.0874 20.0170 0.0703 69.2987
temp: 298.150 k
press: 1.00000 atm
elementType: 8 8 8 8 7 7 7 7 6 6 6 6 6 6 6 6 6 6 6 6 6 1 1 1 1 1 1 1 1 1 1 1 1 1 1 1 1
symmnumber: 1
zpe: 739741.8 jmol-1
zpe.correction: 0.281753 hartree
zpe.thermalcorrener: 0.302646 hartree
zpe.thermalcorrenthalpy: 0.303590 hartree
zpe.thermalcorrgfe: 0.227480 hartree
zpe.sumelectzpe: -1023.119841 hartree
zpe.sumelectthermal: -1023.098947 hartree
zpe.sumelectthermalent: -1023.098003 hartree
zpe.sumelectthermalfe: -1023.174114 hartree
dipole: 8.8364 -0.6827 1.6383
dipole: 9.0129
quadrupole: -143.3992 -136.1291 -123.8575
quadrupole: 0.9093 0.0179 -4.4573
quadrupole: -8.9373 -1.6671 10.6044 0.9093 0.0179 -4.4573
hfenergy: -1023.4015936 hartree
pointgroup: C01 [X(C13H16N4O4)]
dipole: -3.4874646 -0.0815435 0.6360761 debye
polarizability: 341.6052394|-35.6272339|234.2529908|-33.0107736|-15.8475559|106.7832907 unknown
InChI: InChI=1S/C13H16N4O4/c1-2-3-4-5-6-9-14-15-12-8-7-11(16(18)19)10-13(12)17(20)21/h2-3,7-10,15H,4-6H2,1H3
charge 0 multiplicity 1
37 atoms
O  3.097086 3.319038 -0.806641
O  0.868532 3.44242 -0.356152
O  4.544086 -2.682614 0.319848
O  5.582162 -0.76307 -0.360424
N  -0.427517 1.32193 0.437069
N  -1.563265 0.619102 0.848561
N  1.995285 2.767751 -0.436039
N  4.538505 -1.422894 0.021374
C  -5.087503 0.808719 0.29546
C  -3.961194 0.657447 1.358391
C  -4.82514 -0.014119 -0.997834
C  -2.676999 1.309806 0.925438
C  0.778241 0.667744 0.333285
C  -4.872302 -1.511894 -0.766625
C  1.982499 1.346509 -0.090744
C  0.880151 -0.729152 0.647178
C  3.211748 0.658878 -0.191219
C  3.257274 -0.702735 0.125937
C  2.092125 -1.405023 0.547251
C  -3.833598 -2.367216 -0.9581
C  -3.882568 -3.862579 -0.737338
H  -6.04263 0.481122 0.750099
H  -5.21253 1.879253 0.034453
H  -4.297898 1.133881 2.302488
H  -3.774915 -0.410778 1.565939
H  -5.594523 0.26887 -1.745337
H  -3.844146 0.267488 -1.427743
H  -2.718987 2.389283 0.670628
H  -5.835257 -1.914978 -0.411759
H  -0.030877 -1.236854 0.96879
H  4.109944 1.191704 -0.513475
H  -0.41977 2.334747 0.194243
H  2.173214 -2.46858 0.78622
H  -2.873171 -1.956014 -1.307775
H  -3.657759 -4.411563 -1.672572
H  -3.128327 -4.183713 0.007634
H  -4.876378 -4.187222 -0.381402
