program: Gaussian 09
title: 000289897
version: EM64L-G09RevD.01
frameworkgroup: C1[X(C12H11N)]
method: RPBEPBE
basis: SDD
operation: Freq
keyword: #pfreq=noraman
keyword: PBEPBE/SDD
title: #p freq=noraman PBEPBE/SDD
converged: YES YES NO NO
title: Mulliken charges:
elementType: N C C C C C C C C C C C C H H H H H H H H H H H
charge: -0.252963 0.466978 -0.392902 -0.392806 -0.165599 -0.165409 -0.221105 -0.221153 -0.225947 -0.226014 -0.261250 -0.183242 -0.183211 0.244206 0.244076 0.223912 0.223805 0.225032 0.225029 0.195278 0.195266 0.229673 0.209172 0.209174
chargesum: 0.00000
title: Mulliken charges with hydrogens summed into heavy atoms:
elementType: N C C C C C C C C C C C C
charge: -0.252963 0.466978 -0.148696 -0.148730 0.058313 0.058395 0.003927 0.003877 -0.030669 -0.030748 -0.031576 0.025930 0.025963
polarizability: 2.40464909e+02 -7.07901910e-03 1.31113434e+02 -1.20433470e-02 3.22321256e+00 6.17831906e+01
1716.lowfreq: -52.5252 -5.1623 -0.0004 -0.0004 0.0004 8.7890 10.3361 74.9146 93.9359
frequency: -52.5045 74.9144 93.9301 154.0714 270.0926 275.9378 300.8267 395.5257 410.6184 457.1098 464.7856 475.7876 521.7466 576.7425 613.5409 680.8581 695.2619 712.4821 752.0031 753.1124 789.1953 822.0368 841.0147 883.9171 886.6723 923.1055 934.5192 947.5484 949.9032 956.9373 961.0688 973.4278 980.1709 983.0069 1030.5332 1086.9104 1134.2192 1172.8470 1195.3902 1233.6202 1271.8775 1300.9141 1316.5566 1325.2788 1371.8395 1381.3387 1424.5892 1433.5197 1445.4915 1483.8748 1574.0181 1597.3125 1610.4811 1654.8914 1709.7533 3104.0451 3120.4713 3125.4047 3127.5224 3131.0641 3142.2219 3147.0775 3151.4683 3164.2368 3167.2553 3170.5646
redmass: 3.0642 3.8816 4.6397 3.9167 5.0181 4.6651 3.5571 3.6815 2.9741 2.4959 6.6609 7.0962 3.1547 3.0987 6.2452 6.1832 1.9198 1.5210 1.3633 1.7662 1.4599 1.5200 3.2222 1.5865 3.7958 3.4577 1.5067 1.4074 2.1204 3.4683 1.3925 1.2877 1.2981 4.9483 2.0566 1.7238 2.3535 1.0476 1.1121 1.1348 2.3732 1.3179 1.3143 1.4015 1.6633 2.6958 1.4895 1.3651 2.4804 2.3003 5.9062 6.1915 6.0696 5.5648 8.3522 1.0817 1.0874 1.0845 1.0861 1.0877 1.0945 1.0923 1.0964 1.0927 1.0996 1.0964
irintensity: 0.7617 3.1936 1.1847 0.3802 0.1688 0.2606 1.7865 9.9494 4.3652 55.1007 0.5492 0.7418 9.2317 3.3847 0.0594 6.0565 67.0319 72.7548 4.0003 74.1832 0.6045 5.2119 4.6405 1.3071 4.5684 88.2552 0.6962 0.1084 1.0924 10.3689 0.1096 0.3882 0.3249 6.5231 14.3021 4.1000 54.3352 0.8523 8.6886 6.6364 219.7014 4.3933 38.4332 5.4485 3.9781 0.2934 1.0101 2.2247 0.6204 157.2905 19.6049 3.9578 208.1568 7.3021 76.5821 0.0331 18.3769 14.7270 14.6005 13.2137 47.8942 6.4443 20.1054 34.6733 19.5231 0.1616
temp: 298.150 k
press: 1.00000 atm
elementType: 7 6 6 6 6 6 6 6 6 6 6 6 6 1 1 1 1 1 1 1 1 1 1 1
symmnumber: 1
zpe: 507327.1 jmol-1
zpe.correction: 0.193231 hartree
zpe.thermalcorrener: 0.202947 hartree
zpe.thermalcorrenthalpy: 0.203891 hartree
zpe.thermalcorrgfe: 0.157939 hartree
zpe.sumelectzpe: -517.658093 hartree
zpe.sumelectthermal: -517.648377 hartree
zpe.sumelectthermalent: -517.647433 hartree
zpe.sumelectthermalfe: -517.693385 hartree
dipole: -0.3388 0.0002 0.0006
dipole: 0.3388
quadrupole: -68.5865 -66.8337 -82.7945
quadrupole: -0.0017 -0.0041 0.2784
quadrupole: 4.1517 5.9045 -10.0562 -0.0017 -0.0041 0.2784
hfenergy: -517.8513239 hartree
pointgroup: C01 [X(C12H11N1)]
dipole: -0.133295 0.0001003 0.0002363 debye
dipolederiv: -1.7408577 -0.0000439 0.0001322 0.0000178 -0.7193886 0.1413545 -0.0006049 0.1580405 -0.1621048 2.0485942 0.0000358 0.000135 0.0000243 -0.0097319 0.0744161 0.0000925 0.0272774 0.082949 -0.5243141 0.0094274 -0.0042077 -0.4911028 -0.0481174 0.0602406 -0.022797 0.0704889 -0.1523382 -0.5242528 -0.0094578 0.0041377 0.4909584 -0.0480085 0.0603082 0.022728 0.0704505 -0.1523524 0.3755583 -0.3219768 0.0588537 -0.7792735 0.4200705 -0.1470099 -0.0480071 -0.1238035 0.0100553 0.37567 0.3219467 -0.059225 0.7793914 0.4200674 -0.1466826 0.0485887 -0.123459 0.009778 0.2930532 -0.0296064 -0.0121269 0.0058357 0.122486 0.1106641 0.0130483 0.1051347 -0.1012043 0.2928847 0.0295771 0.0122005 -0.0059514 0.1224861 0.1106613 -0.012915 0.1051378 -0.101208 -0.1819418 0.1035159 -0.0182999 0.3517434 0.0914912 -0.1021738 -0.0851276 -0.106058 -0.2304863 -0.1820769 -0.1034184 0.0182569 -0.3518616 0.0918188 -0.1016776 0.0845523 -0.1056138 -0.2308018 -0.2184062 0.0000427 0.0000293 0.000092 -0.2064722 -0.0109885 0.000035 -0.0180597 -0.2105749 0.0704247 0.1040352 -0.0338206 -0.2066813 -0.057112 -0.0145474 0.0542413 -0.0216955 -0.1328949 0.0704397 -0.1043052 0.0331359 0.2064905 -0.0569847 -0.0146201 -0.0547672 -0.0216469 -0.1328734 0.0383205 0.0869323 0.0394683 0.076387 0.0045757 -0.071291 0.0547019 -0.0708702 0.1251884 0.038373 -0.0869418 -0.0394881 -0.0763869 0.0044765 -0.0713207 -0.054729 -0.0709082 0.1251526 0.0355656 -0.0927199 0.0368158 -0.047112 0.0113913 0.0460665 0.0422845 0.0315199 0.1301586 0.0356285 0.0927866 -0.0365303 0.0472416 0.0113224 0.0459479 -0.0419651 0.0314093 0.1303382 0.0175406 -0.0786928 -0.0326418 -0.1041353 -0.045224 -0.0819821 -0.0647212 -0.0747614 0.1230639 0.0174724 0.078739 0.0326282 0.104179 -0.0451972 -0.0819484 0.0646841 -0.0747253 0.1230928 0.0390203 0.0225206 -0.0085914 0.032303 -0.104548 0.0792864 0.0030207 0.0860743 0.1393265 0.038979 -0.0225163 0.0087029 -0.0323245 -0.1047375 0.0790253 -0.0030017 0.0857302 0.1395253 -0.1428992 -0.0000168 -0.0000464 -0.0000179 0.0964697 -0.0318322 -0.000048 -0.0236232 0.1657459 -0.1363775 0.0689189 -0.0157121 0.1002504 0.024386 0.0339861 -0.0245824 0.0319256 0.1512701 -0.1363985 -0.0687822 0.0161939 -0.1000676 0.0244803 0.0341174 0.0252891 0.0320358 0.1511947 unknown
polarizability: 240.4649077|-0.0114509|131.1348514|-0.016048|2.9839302|61.7617748 unknown
InChI: InChI=1S/C12H11N/c1-2-7-11-13(10-6-1)12-8-4-3-5-9-12/h1-11H
charge 0 multiplicity 1
24 atoms
N  0.42201 0.000242 0.000383
C  -1.013005 0.000209 0.000108
C  -1.740838 -1.138987 -0.449217
C  -1.741232 1.139258 0.449176
C  1.095767 -1.223172 0.309068
C  1.095977 1.223694 -0.307637
C  -3.150811 -1.135792 -0.440404
C  -3.1512 1.135751 0.439868
C  2.42741 -1.518535 0.380799
C  2.427682 1.518552 -0.380335
C  -3.869818 -0.000097 -0.000394
C  3.616323 -0.664548 0.156904
C  3.616448 0.663768 -0.158715
H  -1.208087 -2.008397 -0.848501
H  -1.208857 2.008805 0.848659
H  0.391516 -2.016921 0.5750
H  0.391852 2.018053 -0.572035
H  -3.689451 -2.020015 -0.799713
H  -3.690156 2.019858 0.798986
H  2.638313 -2.551977 0.681104
H  2.638739 2.552242 -0.679675
H  -4.96475 -0.000208 -0.000588
H  4.585273 -1.166221 0.276709
H  4.585493 1.16484 -0.280252
