program: Gaussian 09
title: 000289896
version: EM64L-G09RevD.01
frameworkgroup: C1[X(C9H11IO2)]
method: RPBEPBE
basis: SDD
operation: Freq
keyword: #p
keyword: freq=noraman
keyword: PBEPBE/SDD
title: #p freq=noraman PBEPBE/SDD
converged: YES YES NO NO
title: Mulliken charges:
elementType: I O O C C C C C C C C C H H H H H H H H H H H
charge: 0.051888 -0.202240 -0.188519 -0.194515 -0.071387 -0.300818 -0.071991 -0.495840 -0.638820 -0.438780 -0.467187 0.158542 0.268938 0.251633 0.277131 0.300199 0.238633 0.253906 0.339005 0.220348 0.228003 0.257923 0.223947
chargesum: 0.00000
title: Mulliken charges with hydrogens summed into heavy atoms:
elementType: I O O C C C C C C C C C
charge: 0.051888 -0.202240 -0.188519 0.074423 0.180246 -0.023687 0.228208 -0.003301 -0.299815 0.009571 0.014683 0.158542
polarizability: 1.59471891e+02 -1.39973827e+00 9.79249136e+01 -9.64042574e+00 -3.69605314e-01 8.71846372e+01
1716.lowfreq: -12.8450 -4.8845 -0.0004 0.0001 0.0004 10.2031 62.6185 122.6077 147.2039
frequency: 62.1943 122.6016 147.2033 187.2073 197.2546 257.1062 314.3447 366.2568 396.6707 451.3024 533.5353 582.1124 621.0788 641.2520 687.7632 729.4988 767.2767 797.4868 802.5942 841.7811 873.8860 876.2221 902.4855 937.5906 943.6506 980.0352 1016.3253 1030.1014 1044.6883 1077.3204 1102.7221 1125.8759 1132.9574 1147.6967 1168.7291 1204.4438 1206.4577 1231.1805 1256.3081 1276.1810 1282.4571 1291.0108 1297.4814 1316.7678 1320.5275 1328.0984 1342.6786 1365.8026 1465.6153 1473.5954 1487.9184 1715.8574 2994.9385 3002.5852 3007.8590 3035.6361 3044.1216 3046.2877 3061.0445 3071.5246 3077.1039 3089.5133 3118.4224
redmass: 5.8269 6.3305 7.3590 4.0343 2.1776 3.1155 6.2661 2.4284 5.8591 4.5259 4.1518 5.3761 6.2572 6.3430 6.6551 4.9530 2.9001 1.5523 3.4173 3.1912 2.6930 2.8722 4.6125 2.6415 2.1073 4.4432 2.0849 1.8710 2.4665 1.9053 1.7104 1.6968 1.4236 1.1387 1.1558 1.5368 1.4296 1.1690 1.3385 1.4678 1.5378 1.4764 1.4703 1.5973 1.4963 1.4568 1.4445 1.4383 1.0758 1.0789 1.0853 12.4373 1.0603 1.0606 1.0642 1.0861 1.0949 1.0930 1.1037 1.1026 1.0872 1.0890 1.0909
irintensity: 2.4634 1.6460 0.7777 2.8057 0.6479 2.7573 4.3531 1.0356 3.0996 1.5869 2.5229 0.3303 33.8915 2.4894 8.0189 40.1219 12.6073 0.6056 4.0543 9.3563 6.7761 60.0195 60.5617 48.7423 23.2372 7.0102 45.2347 12.7360 2.0786 9.0725 6.6489 22.8798 1.5312 8.6342 3.7100 24.8023 0.9168 1.3684 6.1558 20.0698 4.9301 1.5497 2.5891 0.9506 2.1866 3.5103 2.9237 3.2477 4.0845 17.4472 15.0158 389.0257 23.8461 24.4868 42.3188 41.7084 12.6902 17.0027 12.3673 31.8650 2.5990 20.8222 5.3338
temp: 298.150 k
press: 1.00000 atm
elementType: 53 8 8 6 6 6 6 6 6 6 6 6 1 1 1 1 1 1 1 1 1 1 1
symmnumber: 1
zpe: 486151.7 jmol-1
zpe.correction: 0.185165 hartree
zpe.thermalcorrener: 0.194996 hartree
zpe.thermalcorrenthalpy: 0.195940 hartree
zpe.thermalcorrgfe: 0.148273 hartree
zpe.sumelectzpe: -510.611202 hartree
zpe.sumelectthermal: -510.601372 hartree
zpe.sumelectthermalent: -510.600428 hartree
zpe.sumelectthermalfe: -510.648094 hartree
dipole: -0.9567 4.7669 0.4236
dipole: 4.8804
quadrupole: -101.0001 -90.4518 -80.9116
quadrupole: 13.1536 1.5429 -0.4804
quadrupole: -10.2123 0.3360 9.8762 13.1536 1.5429 -0.4804
hfenergy: -510.7963674 hartree
pointgroup: C01 [X(C9H11I1O2)]
dipole: 1.144967 1.5279019 -0.2033914 debye
dipolederiv: -0.479266 0.2441915 0.0140667 0.1964693 -0.2293745 -0.0176569 0.0477319 -0.0531507 -0.1208267 -1.2087765 0.2060816 0.1502344 0.485816 -0.6854785 -0.1879 0.2359222 -0.0517056 -0.3805552 -1.2835445 0.0343335 0.198344 -0.086667 -0.4611839 -0.00641 0.3231283 -0.045903 -0.3619016 0.0483068 0.043388 0.0209566 -0.0886783 0.0030159 -0.0056018 -0.0259178 -0.0187309 0.1077635 -0.1852527 0.2569303 0.0813375 0.027819 0.0262342 -0.0149541 -0.0048395 -0.0279145 0.0879281 -0.147363 -0.211201 0.0485965 -0.1928809 -0.1097627 -0.050454 0.0273243 -0.0570447 -0.004733 0.5793435 -0.0653223 -0.0161755 0.2133924 0.1756196 0.0209111 0.185506 -0.1198306 0.2715938 0.1551316 -0.0823943 -0.0266184 0.0820267 -0.0312776 -0.034754 0.0999607 0.0235076 0.1242257 0.6962286 -0.4775007 -0.0410199 -0.405064 0.2967448 0.0596536 -0.2148424 0.1801063 -0.0122094 0.0428669 -0.0341066 -0.0406728 -0.0560612 0.1030403 0.0031875 0.0065283 -0.0089886 0.0845701 0.0586504 -0.0199611 0.028615 -0.0308527 0.048922 0.0545804 0.0353901 0.0338134 0.0161865 1.828298 -0.0827472 -0.3865833 -0.3893198 0.9876547 0.2627915 -0.6124259 0.2059595 0.3113835 -0.0184063 0.015289 -0.100578 0.0124645 0.0476136 -0.0037832 -0.0944531 0.0103664 -0.1032608 0.0087326 -0.0148433 -0.0923838 0.0062823 0.0566426 0.0298592 -0.0792876 0.0140283 -0.1072089 0.0067987 0.0768882 -0.0236074 0.0879836 -0.0377393 0.0159402 -0.0241763 0.0166099 0.0612085 0.0009257 0.0313926 0.0228717 0.0049395 0.0343453 -0.0619328 0.026281 -0.0631887 0.0000633 -0.0052477 0.0114152 -0.0297677 0.0197758 -0.1434277 -0.0940375 -0.030924 -0.0526571 0.0453848 -0.0061933 -0.0344827 0.0733474 -0.0601812 0.0549178 0.1031382 0.0573217 0.04814 -0.0485423 -0.0679254 -0.002267 0.0625506 0.0595178 -0.0158681 0.0062316 0.02591 0.0322465 0.0178439 0.0464198 0.0546999 -0.0433525 0.0195115 -0.1461074 0.0984416 -0.026575 0.0429723 0.036114 -0.0307175 0.0071499 0.1015297 0.0445884 0.0694301 -0.0884417 0.0650885 -0.0262079 -0.0712391 -0.1197246 0.0167622 0.0013199 0.0786946 0.102867 0.000701 0.0176984 0.0032519 0.044701 0.0807149 0.0263041 -0.0030106 -0.0295763 -0.1468284 -0.0895098 -0.0403496 -0.0856798 0.0015101 unknown
polarizability: 149.3068635|-23.1926004|108.3799968|-7.671915|3.7986538|86.8945812 unknown
InChI: InChI=1S/C9H11IO2/c10-7-4-1-2-5-6(3-4)9(11)12-8(5)7/h4-8H,1-3H2
charge 0 multiplicity 1
23 atoms
I  2.928807 -1.93163 0.103576
O  -1.29973 -1.381717 -0.445701
O  -3.222455 -0.372775 0.40443
C  -0.156639 0.599561 -1.17982
C  1.10899 0.457827 1.113067
C  -1.134854 0.96943 -0.025451
C  0.085836 -0.88482 -0.792746
C  -0.32414 1.051271 1.323241
C  0.94628 -0.952615 0.499969
C  1.136932 1.438912 -1.228226
C  1.869847 1.40324 0.150263
C  -2.050036 -0.261989 0.021851
H  -0.682768 0.638352 -2.150861
H  1.630341 0.392203 2.084318
H  -1.730911 1.877342 -0.198489
H  0.442909 -1.533807 -1.602409
H  -0.219188 2.105689 1.635421
H  -0.864047 0.526914 2.132905
H  0.491659 -1.668187 1.20418
H  0.882126 2.475475 -1.515056
H  1.791586 1.044135 -2.027478
H  2.912441 1.061799 0.033394
H  1.908012 2.410588 0.603624
