program: Gaussian 09
title: 000289887
version: EM64L-G09RevD.01
frameworkgroup: C1[X(C17H26N2O2S)]
method: RPBEPBE
basis: SDD
operation: Freq
keyword: #p
keyword: freq=noraman
keyword: PBEPBE/SDD
title: #p freq=noraman PBEPBE/SDD
converged: NO YES NO NO
title: Mulliken charges:
elementType: S O O N N C C C C C C C C C C C C C C C C C H H H H H H H H H H H H H H H H H H H H H H H H H H
charge: 0.957583 -0.544276 -0.517498 -0.000307 -0.501427 0.027404 0.331880 -0.480253 -0.471830 -0.522788 -0.557752 -0.756482 -0.743408 -0.746590 0.180735 -0.036456 -0.228569 -0.243907 -0.397016 -0.332851 0.454143 -0.800402 0.175224 0.222520 0.215177 0.219679 0.221599 0.210977 0.238791 0.219251 0.226306 0.210984 0.220672 0.220295 0.210417 0.211311 0.214715 0.217787 0.210668 0.210961 0.298217 0.287081 0.281222 0.242770 0.241442 0.235065 0.238522 0.228414
chargesum: 0.00000
title: Mulliken charges with hydrogens summed into heavy atoms:
elementType: S O O N N C C C C C C C C C C C C C C C C C
charge: 0.957583 -0.544276 -0.517498 -0.000307 -0.203210 0.202628 0.331880 -0.042556 -0.030552 -0.073019 -0.112194 -0.104532 -0.106965 -0.107174 0.180735 -0.036456 0.058512 0.037314 -0.154246 -0.091409 0.454143 -0.098401
polarizability: 3.00897901e+02 1.60053389e+01 2.28862997e+02 -1.23898035e+01 7.36332569e+00 2.02816787e+02
1716.lowfreq: -0.5221 -0.0020 -0.0016 -0.0011 8.5087 10.4041 14.4479 24.3510 24.9630
frequency: 12.6604 23.9569 24.3999 29.2081 33.3538 44.4779 65.3610 85.8024 106.0751 129.5569 136.8413 156.6831 182.4036 191.5445 211.8617 224.2513 234.0925 242.8711 257.8250 269.4695 282.0878 297.8534 317.5537 324.0672 346.3739 361.6764 375.1661 387.3093 397.2646 408.2299 417.3252 424.6648 433.6627 457.4175 476.3289 509.7163 515.8244 553.4501 585.0248 622.3636 624.2959 709.7474 717.4002 757.0713 777.6625 779.2623 807.1850 819.1334 828.1548 843.1387 848.8333 916.7012 920.5850 923.7660 927.5785 936.3044 946.1627 949.5796 957.8314 964.4447 982.6880 987.9606 998.6004 1001.7734 1016.8048 1021.6322 1043.3795 1050.3474 1056.9784 1088.7318 1096.3878 1117.1484 1118.9818 1171.7998 1184.3370 1184.9014 1217.8889 1225.2967 1227.4749 1238.8791 1257.6611 1284.1669 1288.3347 1289.6524 1297.4939 1301.4630 1324.4638 1329.2737 1347.1912 1363.8436 1375.6714 1376.6232 1382.0807 1392.7506 1402.3034 1402.5145 1447.1429 1455.9689 1458.7107 1463.7646 1466.3279 1469.5051 1471.0069 1471.9477 1474.8979 1475.9800 1487.7989 1490.3243 1498.1133 1596.0623 1598.4505 1607.0738 2918.0409 2955.8912 2961.8322 2966.9019 2970.3342 2976.3946 2982.3729 2984.7533 2991.4056 3036.8729 3050.1057 3055.2545 3057.8438 3061.5846 3063.0596 3067.1684 3068.5978 3069.9503 3075.5452 3076.8189 3092.0563 3134.2838 3139.1463 3164.1343 3170.0898 3233.0181
redmass: 3.8401 3.2368 1.1589 3.4749 3.3812 2.7496 6.0291 5.1626 4.5832 5.9551 3.5952 3.7665 1.5086 3.3864 3.4746 5.9298 1.5710 1.4165 1.0778 3.8635 3.5566 4.1809 2.3429 2.4195 2.3521 2.6241 2.6361 3.5607 4.7453 2.8723 4.1356 4.3873 2.7318 2.4655 3.1821 3.0108 2.4972 3.1588 5.3181 6.7522 3.7883 3.2549 3.6232 2.6360 4.9486 1.5470 6.0956 2.8007 1.3941 2.2137 1.2526 2.0200 1.3915 1.7265 1.8568 1.2191 6.3475 2.8174 2.4849 1.3606 1.3981 1.8257 2.3868 1.8855 2.2497 1.4473 2.0840 1.5814 2.4907 1.5325 1.7989 1.7564 1.2852 1.5838 1.3969 1.3648 3.0099 2.3607 1.9345 1.8266 1.7000 1.4418 1.3227 1.3325 1.2605 1.3994 1.3260 1.4932 1.8170 1.4574 1.2043 1.2016 4.6370 3.0190 1.3141 1.2068 1.0932 1.0899 1.0743 1.0647 1.0484 1.0764 1.0453 1.0634 2.3388 1.1202 1.0516 1.0600 1.0582 6.7094 6.2764 8.6282 1.0822 1.0665 1.0635 1.0356 1.0355 1.0368 1.0376 1.0607 1.0605 1.0958 1.1011 1.1018 1.0995 1.0974 1.0990 1.0986 1.0944 1.0992 1.0978 1.0982 1.0990 1.0894 1.0898 1.0957 1.0961 1.0738
irintensity: 1.0008 0.8335 0.4983 0.3160 0.0179 0.5349 0.5296 0.8159 0.1735 0.2409 4.1421 1.0189 1.0402 0.7208 1.3310 17.8614 0.5444 0.1256 0.3246 8.0606 17.7747 0.0558 5.4724 0.1496 7.6285 9.8852 3.3421 8.3427 18.9936 2.4626 62.0505 32.0091 2.1815 2.5766 4.6212 74.3073 3.8843 23.4217 15.0236 1.7155 40.4563 0.4625 30.5850 4.4949 5.6977 1.6033 127.2849 32.8471 24.8664 70.4357 0.9775 1.5035 7.3432 1.0027 5.2538 1.7815 68.3751 22.7422 1.9868 3.5383 0.3603 2.9221 4.0850 5.6170 11.9352 1.9693 0.7083 14.9378 27.8605 0.5880 2.6652 1.9634 7.5433 5.7277 10.9479 5.2676 5.6628 8.5300 7.8565 15.8187 8.2588 3.1229 11.1308 1.6349 2.7285 4.2443 2.7196 3.0793 8.9115 2.3769 23.1769 21.1262 3.1459 10.4992 14.2635 17.8166 12.1608 16.2433 6.9171 1.1424 1.1717 2.8118 13.7268 2.6478 22.4163 16.6360 9.8221 6.0660 32.7464 5.1672 6.7396 52.9252 28.0587 15.2592 26.5967 27.0279 41.2476 9.4572 25.9724 22.8061 45.7142 26.6661 19.1876 45.9795 1.0108 16.3867 50.2963 80.5463 25.1838 22.7387 51.1371 72.9523 16.8092 13.2113 10.6848 2.9101 6.8068 11.2814
temp: 298.150 k
press: 1.00000 atm
elementType: 16 8 8 7 7 6 6 6 6 6 6 6 6 6 6 6 6 6 6 6 6 6 1 1 1 1 1 1 1 1 1 1 1 1 1 1 1 1 1 1 1 1 1 1 1 1 1 1
symmnumber: 1
zpe: 1045625.3 jmol-1
zpe.correction: 0.398258 hartree
zpe.thermalcorrener: 0.422905 hartree
zpe.thermalcorrenthalpy: 0.423850 hartree
zpe.thermalcorrgfe: 0.340767 hartree
zpe.sumelectzpe: -1319.524714 hartree
zpe.sumelectthermal: -1319.500067 hartree
zpe.sumelectthermalent: -1319.499122 hartree
zpe.sumelectthermalfe: -1319.582205 hartree
dipole: -3.4548 5.2442 -0.9224
dipole: 6.3473
quadrupole: -131.3896 -144.7539 -141.1305
quadrupole: 29.5215 -3.0303 2.8359
quadrupole: 7.7018 -5.6626 -2.0392 29.5215 -3.0303 2.8359
hfenergy: -1319.922972 hartree
pointgroup: C01[X(C17H26N2O2S1)]
dipole: 1.315406 -2.0340345 0.6070566 debye
polarizability: 302.2397599|16.4902897|215.6327106|-0.5213411|-15.6714748|214.705215 unknown
InChI: InChI=1S/C17H26N2O2S/c1-13-5-11-16(12-6-13)22(20,21)19-18-15-9-7-14(8-10-15)17(2,3)4/h5-6,11-12,14,19H,7-10H2,1-4H3
charge 0 multiplicity 1
48 atoms
S  -2.744325 1.735345 -0.982857
O  -3.348975 1.9616 -2.478728
O  -2.72497 2.927305 0.124303
N  -0.184991 1.053794 -0.231582
N  -0.956459 1.073846 -1.385001
C  3.900988 -0.045047 -0.210793
C  5.091192 -1.082168 -0.199377
C  2.954719 -0.155331 1.015612
C  3.046176 -0.093183 -1.506497
C  1.88769 0.973922 1.019995
C  1.976534 1.037735 -1.551352
C  4.590828 -2.549783 -0.28779
C  6.043473 -0.801812 -1.397301
C  5.91944 -0.913019 1.10681
C  1.130484 1.03737 -0.289132
C  -3.522175 0.222116 -0.198187
C  -3.552521 0.147829 1.20159
C  -4.070036 -0.75751 -1.042466
C  -4.168905 -0.98351 1.782963
C  -4.680446 -1.874765 -0.43569
C  -4.736405 -2.005793 0.979302
C  -5.404219 -3.214007 1.610452
H  4.377225 0.962628 -0.167478
H  3.526685 -0.097694 1.958976
H  2.439637 -1.136202 1.003643
H  2.528941 -1.070228 -1.573686
H  3.685112 0.001215 -2.402878
H  2.405554 1.944575 1.176888
H  1.16898 0.846011 1.847324
H  1.35786 0.916547 -2.460215
H  2.498136 2.014831 -1.630867
H  5.449131 -3.246771 -0.249345
H  3.918933 -2.80408 0.552022
H  4.04906 -2.743342 -1.231376
H  6.377075 0.253889 -1.403171
H  6.944623 -1.439361 -1.326193
H  5.566521 -1.016346 -2.370272
H  5.358276 -1.237467 2.001119
H  6.840293 -1.52397 1.056765
H  6.222002 0.141641 1.254961
H  -0.651972 1.690842 -2.172526
H  -3.123127 0.951534 1.80738
H  -4.034254 -0.637223 -2.129819
H  -4.208139 -1.070212 2.874589
H  -5.121483 -2.6543 -1.067925
H  -4.948522 -4.155619 1.252309
H  -6.478886 -3.254719 1.351707
H  -5.323357 -3.195219 2.710189
