program: Gaussian 09
title: 000289884
version: EM64L-G09RevD.01
frameworkgroup: C1[X(C10H14O2)]
method: RPBEPBE
basis: SDD
operation: Freq
keyword: #pfreq=noraman
keyword: PBEPBE/SDD
title: #p freq=noraman PBEPBE/SDD
converged: NO YES NO NO
title: Mulliken charges:
elementType: O O C C C C C C C C C C H H H H H H H H H H H H H H
charge: -0.284637 -0.269182 0.286340 -0.207435 -0.237561 -0.432716 -0.434173 -0.474945 -0.193520 -0.196092 -0.322933 -0.334923 0.245497 0.229992 0.208970 0.231300 0.238727 0.208515 0.237868 0.210602 0.215333 0.199996 0.207095 0.226762 0.231001 0.210118
chargesum: 0.00000
title: Mulliken charges with hydrogens summed into heavy atoms:
elementType: O O C C C C C C C C C C
charge: -0.284637 -0.269182 0.286340 0.038062 -0.007569 0.007554 0.013069 -0.026475 0.021814 0.003904 0.110924 0.106196
polarizability: 1.12889501e+02 4.20875579e+00 9.77038714e+01 5.46312026e+00 2.68130643e+00 9.67943579e+01
1716.lowfreq: -79.2056 -19.7157 -14.2917 -0.0011 -0.0006 -0.0005 4.5015 111.8603 133.0766
frequency: -78.9644 111.7925 133.0270 157.2605 204.7923 264.1824 292.5908 390.4284 430.6011 447.1063 474.2365 527.4850 658.2316 680.1543 691.1788 725.3468 731.2864 781.4662 828.0272 838.4431 867.3544 886.9952 892.6770 914.3390 922.1106 958.7517 966.2968 973.6057 984.4929 1000.5933 1017.2148 1034.4653 1070.7275 1084.4414 1109.4165 1125.9234 1154.4063 1164.0134 1176.8593 1185.4839 1188.1362 1221.1842 1224.2678 1246.8795 1279.0492 1293.2875 1304.1072 1309.6437 1319.5482 1325.6352 1349.4136 1369.7119 1446.9391 1458.4793 1477.1262 1482.0043 1492.5691 1660.0948 2966.5861 2982.0880 2997.4645 3008.0998 3011.5031 3018.8974 3035.9485 3056.9178 3064.8269 3068.2306 3088.7400 3091.6157 3100.5780 3133.0423
redmass: 1.8747 3.1251 2.8906 2.3876 6.5101 2.5704 2.4061 4.6844 3.2931 2.9972 4.1455 3.6066 2.5096 2.8921 5.2359 3.4003 3.5092 1.7394 1.2886 2.0386 2.3439 3.8167 3.0340 3.4304 2.2077 1.3471 3.8534 7.1109 2.7082 2.5158 2.5916 1.9134 2.4591 1.8752 1.5982 1.6457 1.1230 1.1518 1.3226 1.1590 1.1502 1.2865 1.7414 1.5282 1.5881 1.4530 1.4512 1.2518 1.3238 1.6243 1.6946 1.6294 1.0889 1.0815 1.0934 1.0869 1.0880 6.5717 1.0596 1.0644 1.0643 1.0616 1.0967 1.0650 1.0836 1.0927 1.1014 1.0995 1.1051 1.1032 1.0845 1.1007
irintensity: 1.6610 8.4400 1.0107 1.2065 2.6970 2.9829 0.7355 6.9050 5.9974 2.8741 5.5762 1.6675 10.3425 25.9263 1.5675 21.9156 8.5576 11.1898 0.7952 8.5708 3.4579 25.7469 8.2811 43.7294 20.9676 1.1792 26.6516 12.0320 9.6088 16.0216 20.9975 11.2981 80.9989 9.0911 3.7543 11.2563 3.7271 10.5725 6.2271 14.4734 12.5634 2.3229 8.2241 0.8912 2.4671 1.7663 2.5937 1.3797 1.0773 15.4419 19.2270 4.6733 11.3344 8.1893 14.0508 3.2499 3.1413 3.4142 43.2947 32.1545 102.7798 17.8626 14.3263 77.1524 46.9058 16.2126 9.7025 9.7167 59.5276 49.0116 10.6180 51.8405
temp: 298.150 k
press: 1.00000 atm
elementType: 8 8 6 6 6 6 6 6 6 6 6 6 1 1 1 1 1 1 1 1 1 1 1 1 1 1
symmnumber: 1
zpe: 579772.7 jmol-1
zpe.correction: 0.220824 hartree
zpe.thermalcorrener: 0.230126 hartree
zpe.thermalcorrenthalpy: 0.231070 hartree
zpe.thermalcorrgfe: 0.186634 hartree
zpe.sumelectzpe: -538.941214 hartree
zpe.sumelectthermal: -538.931912 hartree
zpe.sumelectthermalent: -538.930968 hartree
zpe.sumelectthermalfe: -538.975403 hartree
dipole: 1.0140 -0.0856 1.0837
dipole: 1.4866
quadrupole: -62.2937 -75.3753 -69.2213
quadrupole: -0.9173 3.0946 0.4313
quadrupole: 6.6697 -6.4118 -0.2579 -0.9173 3.0946 0.4313
hfenergy: -539.1620375 hartree
pointgroup: C01 [X(C10H14O2)]
dipole: -0.3698971 0.044961 0.4507905 debye
dipolederiv: -1.0563756 -0.1711606 0.038744 -0.0532358 -0.517769 -0.0178267 -0.0393437 0.0148772 -0.3562155 -0.9041451 0.25107 0.0604986 0.2103684 -0.6305706 -0.016653 -0.0282542 -0.0484561 -0.3643809 1.1738324 -0.0689839 0.0843944 -0.09999 0.6740726 0.0134214 0.3024704 0.0054781 0.4237107 -0.0523561 0.0125405 0.0711549 0.0146041 0.0526077 0.0160982 0.0774821 0.0366978 0.0300635 -0.0495886 0.0275569 -0.1537392 -0.0331907 -0.1108634 0.0196266 -0.2291403 -0.0450878 -0.0636128 0.1055811 0.0252817 -0.0026469 0.010044 0.0217117 0.0685775 0.0352511 0.0450673 0.0221178 0.0775152 -0.0035107 0.0767905 -0.0021487 0.0746076 -0.0351866 0.023623 0.0139258 0.0435336 0.1235948 -0.0606795 -0.0785831 -0.0467235 0.0662794 0.0034834 -0.0330529 -0.0096376 -0.0037953 -0.0425625 0.2339125 0.0672741 0.2545443 -0.0019018 0.0401869 0.0374904 0.0561963 -0.0079201 -0.0933605 0.1038111 0.0708645 0.1630226 -0.086408 0.0096334 0.0305965 0.0218486 0.1538237 0.6003524 0.0486984 -0.0447369 -0.1578643 0.1091247 -0.0257269 -0.0985885 -0.1119399 0.3228957 0.5152569 -0.1610784 -0.0614911 -0.0048267 0.1539366 0.0161196 -0.0618078 0.1208148 0.3630252 0.0340942 -0.0129318 -0.09225 -0.0070658 0.0338056 -0.0237648 -0.0839264 -0.0095466 -0.1206555 -0.0385333 -0.0183654 0.1297871 -0.0035997 0.0455636 -0.0116487 0.1150583 -0.0133527 -0.0914308 -0.1716316 0.0357851 0.0701954 -0.0241383 0.0705298 0.0225168 0.0312587 0.0058013 0.03589 0.070639 -0.0723246 -0.049098 -0.0251963 -0.1003245 -0.091574 -0.0081829 -0.0950459 -0.0040889 0.0100975 -0.1260165 0.0585007 -0.10773 -0.1085679 0.0609999 0.02048 -0.0018829 0.0399825 -0.0980157 0.0763416 -0.1172852 0.0473092 0.0656203 0.004234 -0.0885537 0.0450138 -0.0312984 0.0796182 0.0768828 -0.10054 0.0494006 -0.0764405 0.0633685 -0.0390248 0.0734214 -0.004194 -0.1191387 0.00343 0.133763 0.0292565 0.0779844 -0.0783992 0.1042982 -0.0172689 -0.038734 0.0640642 -0.0860446 -0.0521891 -0.0999921 0.082777 -0.0499022 -0.0813741 -0.0710867 -0.1135238 -0.015863 -0.1647157 -0.0307514 -0.1709038 -0.0112852 -0.0318875 -0.028391 -0.029373 0.046537 -0.0175157 -0.016186 0.0393996 -0.0137261 0.0245054 0.0630066 0.1533849 0.095671 -0.1424802 -0.1376468 -0.044864 -0.0712928 -0.0187454 0.0631925 -0.0152039 -0.1247056 -0.0384456 -0.0022629 -0.0655734 0.1052416 -0.0378441 0.1044793 -0.0038837 0.0355991 -0.0754025 0.0708838 0.0398997 0.0076609 0.0063096 -0.008919 -0.0139519 0.0316959 -0.0390983 0.0883549 -0.1145733 -0.1768863 unknown
polarizability: 112.1979346|3.7602657|97.5246851|-6.5566733|-2.8772712|97.6651105 unknown
InChI: InChI=1S/C10H14O2/c1-2-8-4-5-9(3-1)10(8)11-6-7-12-10/h1-2,8-9H,3-7H2
charge 0 multiplicity 1
26 atoms
O  -1.539791 -1.058094 -0.430764
O  -1.126162 1.230928 -0.401187
C  -0.4570 -0.060135 -0.27328
C  0.62867 -0.277874 -1.341486
C  0.346293 -0.297608 1.041325
C  1.3493 -1.565098 -0.826743
C  1.018554 -1.66784 0.710141
C  1.564557 0.964097 -1.336721
C  1.411121 0.787005 1.17321
C  1.987154 1.342482 0.074228
C  -2.766085 -0.447777 0.128306
C  -2.443244 1.075681 0.246705
H  0.173049 -0.414812 -2.336266
H  -0.298341 -0.347342 1.936962
H  2.437435 -1.49545 -1.002102
H  0.979522 -2.458666 -1.358148
H  0.308608 -2.492309 0.898457
H  1.921692 -1.836319 1.321512
H  1.044532 1.825502 -1.803645
H  2.4545 0.75369 -1.963902
H  1.723978 1.083072 2.182868
H  2.765382 2.10997 0.184272
H  -3.001025 -0.89374 1.113651
H  -3.584098 -0.663753 -0.578788
H  -3.146645 1.720644 -0.303202
H  -2.391256 1.40005 1.304299
