program: Gaussian 09
title: 000289883
version: EM64L-G09RevD.01
frameworkgroup: C1[X(C8H11Br)]
method: RPBEPBE
basis: SDD
operation: Freq
keyword: #pfreq=noraman
keyword: PBEPBE/SDD
title: #p freq=noraman PBEPBE/SDD
converged: YES YES NO NO
title: Mulliken charges:
elementType: Br C C C C C C C C H H H H H H H H H H H
charge: -0.060112 -0.117191 -0.160850 -0.540831 -0.439003 -0.456856 -0.486856 -0.208951 -0.190363 0.258763 0.255962 0.319114 0.245360 0.216103 0.223861 0.257111 0.224078 0.223699 0.228441 0.208521
chargesum: 0.00000
title: Mulliken charges with hydrogens summed into heavy atoms:
elementType: Br C C C C C C C C
charge: -0.060112 0.141572 0.095111 -0.221717 0.022460 0.024116 -0.039079 0.019490 0.018158
polarizability: 1.20664248e+02 6.38672280e+00 8.58916171e+01 5.58038287e+00 -2.36521257e+00 7.48063229e+01
1716.lowfreq: -12.8615 -6.0527 -0.0001 0.0004 0.0007 13.6256 127.6884 143.6455 184.3664
frequency: 127.4962 143.5243 184.3633 219.3069 295.3212 341.2778 445.8196 484.7467 610.4611 679.3511 709.7690 737.3345 781.8691 814.1794 841.1740 877.2461 892.3268 921.7245 951.1923 960.5695 972.6190 1021.5976 1037.1521 1064.0641 1074.3017 1135.8898 1154.4455 1177.3805 1179.9443 1190.6566 1224.0371 1228.6570 1262.1306 1280.5538 1296.7322 1299.5873 1321.1071 1338.2246 1365.5350 1455.1308 1462.2891 1477.6113 1653.8722 2957.2009 3002.5224 3009.6046 3021.6046 3053.3514 3061.6588 3066.6493 3089.1970 3101.2547 3105.2237 3137.9800
redmass: 2.6679 2.9591 3.8559 6.1040 2.5229 2.3909 2.2619 3.3676 5.9540 1.6663 4.3838 2.0765 2.1612 2.3717 3.5123 2.2724 2.8037 2.0526 2.1293 1.5975 1.7887 2.0496 1.9864 1.5696 1.9037 1.2037 1.1249 1.0886 1.1721 1.3299 1.2690 1.5155 1.3847 1.5722 1.3743 1.5966 1.5049 1.4295 1.6029 1.0864 1.0836 1.0901 6.4270 1.0607 1.0978 1.0602 1.0626 1.0894 1.0874 1.1014 1.1048 1.0901 1.0853 1.1005
irintensity: 0.2420 0.2507 0.3289 4.3524 2.9470 0.4316 4.0549 1.8303 26.5315 28.2840 15.5835 43.3797 3.0002 6.1183 20.4135 8.8028 2.0508 1.8694 3.0352 4.6017 5.2466 3.5456 2.3365 2.3600 1.7273 0.8346 6.9770 4.2783 10.7547 10.4813 2.7737 6.6949 2.6417 6.9502 3.3782 14.1582 2.7737 5.4855 1.5543 3.9417 14.2269 12.1915 5.0832 45.8244 16.5012 28.7223 52.3620 33.5928 8.2933 5.8011 46.1618 9.1324 8.5811 46.3196
temp: 298.150 k
press: 1.00000 atm
elementType: 35 6 6 6 6 6 6 6 6 1 1 1 1 1 1 1 1 1 1 1
symmnumber: 1
zpe: 444405.6 jmol-1
zpe.correction: 0.169265 hartree
zpe.thermalcorrener: 0.177197 hartree
zpe.thermalcorrenthalpy: 0.178141 hartree
zpe.thermalcorrgfe: 0.135762 hartree
zpe.sumelectzpe: -324.205410 hartree
zpe.sumelectthermal: -324.197478 hartree
zpe.sumelectthermalent: -324.196534 hartree
zpe.sumelectthermalfe: -324.238913 hartree
dipole: -2.8863 -0.1666 0.1613
dipole: 2.8956
quadrupole: -65.5373 -61.2116 -63.6164
quadrupole: 1.4475 1.3209 -0.7945
quadrupole: -2.0822 2.2435 -0.1613 1.4475 1.3209 -0.7945
hfenergy: -324.3746749 hartree
pointgroup: C01 [X(C8H11Br1)]
dipole: 1.1065595 0.0661107 0.2626334 debye
dipolederiv: -0.8168524 0.0020376 -0.1073619 0.0238672 -0.1938606 -0.0043575 -0.037755 -0.0074416 -0.1739482 -0.1645242 -0.0822267 -0.0670759 -0.0567179 0.0341377 -0.0180952 0.0567196 -0.0235157 0.0803583 -0.2250709 0.1229756 0.0072807 0.0306917 0.0733283 -0.0013389 0.2017772 0.0706551 0.0787956 1.1745713 -0.0491889 0.1884414 -0.0664134 0.1093585 0.010858 0.0430037 0.0170902 0.0688692 0.0926004 -0.0345818 0.028288 -0.0370947 0.0000074 0.0364923 0.0529187 0.0470692 0.0079149 0.0757388 -0.0219995 0.007205 -0.0114257 0.02102 -0.0242454 0.0051762 -0.0583746 0.0372572 0.0709638 0.0516674 0.0413094 -0.0102347 0.0043302 -0.0305474 -0.087993 -0.03227 0.1459738 0.2144381 -0.044281 -0.1210901 0.0575534 -0.0294713 0.0421859 -0.1748124 0.0052482 -0.2407439 0.0346351 -0.0558879 -0.0236051 -0.0220826 0.1199962 0.0553639 -0.0376129 0.045384 -0.2305492 0.0315427 0.0903174 0.0107745 0.0731479 -0.1111324 0.0294706 0.0001967 0.0204073 0.0497884 0.0439667 -0.0719939 -0.0181519 -0.0425474 -0.0812016 -0.0774195 -0.0322659 -0.0801722 0.0242678 -0.1036959 -0.0090439 0.0469154 -0.0006446 0.0527407 0.0284466 -0.0044753 0.0216507 -0.0812267 -0.0591989 0.0765596 0.121254 0.0497731 0.0257201 -0.0475922 0.0663455 -0.0293046 0.018368 -0.0566743 -0.0683141 -0.1446758 -0.0353917 0.0296217 -0.0370445 -0.0879978 -0.0314155 -0.0204931 -0.0012424 0.1062734 -0.1045083 0.0584136 -0.0168877 0.0692677 -0.0874454 0.0589181 -0.0076095 -0.1132614 -0.1113842 0.0911414 -0.0365716 0.0324992 -0.0020186 0.0678421 0.021556 0.0456983 -0.0280591 -0.0388404 -0.0768723 -0.0536329 -0.0126461 -0.0741035 -0.0928554 -0.1412263 -0.0328246 0.0525557 0.0369271 0.0352123 -0.031246 -0.0427226 0.0979884 0.0704511 0.1424728 -0.0833872 -0.055352 0.0815448 0.0293612 0.1004249 -0.0727472 -0.0394923 0.0089249 -0.0284522 0.1629276 -0.1670809 0.0194394 0.056158 0.0101315 0.0579096 -0.0138186 0.0698575 -0.0182788 0.1505632 unknown
polarizability: 121.7915033|4.0821344|86.1287033|2.1937312|-0.3646053|73.4419816 unknown
InChI: InChI=1S/C8H11Br/c9-8-6-2-1-3-7(8)5-4-6/h1-2,6-8H,3-5H2
charge 0 multiplicity 1
20 atoms
Br -2.792001 0.128013 -0.824138
C  -0.16922 1.178222 0.144918
C  -0.176893 -1.186593 -0.20842
C  -0.733198 0.11511 -0.819526
C  -0.36037 0.532445 1.556454
C  -0.479327 -1.01473 1.315148
C  1.340115 1.357986 -0.219461
C  1.336444 -1.154417 -0.450496
C  2.02577 0.018677 -0.442149
H  -0.685976 2.148591 0.057308
H  -0.626626 -2.097636 -0.636183
H  -0.490705 0.267528 -1.881513
H  -1.278712 0.917369 2.032501
H  0.487815 0.781316 2.21845
H  0.231043 -1.59105 1.932085
H  -1.499481 -1.37112 1.540782
H  1.844369 1.916909 0.595015
H  1.441732 1.986754 -1.129104
H  1.852387 -2.11006 -0.607133
H  3.112138 0.022484 -0.604539
