program: Gaussian 09
title: 000289882
version: EM64L-G09RevD.01
frameworkgroup: C1[X(C9H12O2)]
method: RPBEPBE
basis: SDD
operation: Freq
keyword: #pfreq=noraman
keyword: PBEPBE/SDD
title: #p freq=noraman PBEPBE/SDD
converged: NO YES NO NO
title: Mulliken charges:
elementType: O O C C C C C C C C C H H H H H H H H H H H H
charge: -0.419234 -0.229991 -0.164540 -0.212689 -0.210191 -0.456283 -0.475240 -0.494628 -0.205014 -0.199002 0.118197 0.246773 0.289897 0.247905 0.213528 0.251178 0.240041 0.220758 0.217167 0.220522 0.221972 0.203965 0.374911
chargesum: 0.00000
title: Mulliken charges with hydrogens summed into heavy atoms:
elementType: O O C C C C C C C C C
charge: -0.044323 -0.229991 0.082233 0.077208 0.037713 0.008423 -0.014442 -0.056939 0.016958 0.004963 0.118197
polarizability: 1.05284904e+02 -6.40254101e-01 9.12612066e+01 6.87717041e+00 -4.29619780e+00 8.31461361e+01
1716.lowfreq: -0.0009 -0.0007 -0.0004 14.8885 20.4949 25.2144 36.5883 134.7925 148.6235
frequency: 31.1685 134.7793 148.5948 160.9680 253.7932 311.3628 337.1979 409.0168 437.1973 501.6344 571.4703 580.9676 652.3886 691.8146 696.1566 734.9992 784.4701 826.4558 840.7444 864.7169 890.9721 923.5791 929.4971 959.8646 963.2967 983.5876 1023.8193 1029.7409 1061.2502 1066.7178 1086.2575 1130.8761 1151.8836 1174.9919 1182.4389 1215.8885 1224.5586 1239.0886 1264.5056 1285.3416 1294.6259 1308.4787 1315.8081 1333.2056 1363.4564 1369.3666 1453.9939 1464.0990 1480.2610 1652.3316 1657.7305 2951.0607 2997.9477 2999.4003 3016.5701 3033.3876 3043.4683 3053.4249 3065.1170 3087.3385 3100.4819 3132.7150 3506.0681
redmass: 8.3828 4.3727 2.0583 3.8356 3.2249 2.5061 4.4356 3.7324 2.3764 3.0877 1.9365 3.2555 1.9366 2.3457 3.0989 2.4274 1.8176 2.4424 5.4059 2.3746 2.8687 1.9843 2.7973 1.8093 1.4418 3.4425 2.1997 2.1095 1.7421 1.6374 1.7963 1.4042 1.1246 1.2298 1.1015 1.5126 1.2308 1.3902 1.3910 1.7849 1.4508 1.5825 1.4318 1.5210 1.8636 1.6364 1.0870 1.0830 1.0960 8.3580 6.4304 1.0620 1.0925 1.0663 1.0637 1.0834 1.0873 1.0892 1.0994 1.1041 1.0847 1.1005 1.0639
irintensity: 0.9301 0.8265 0.0801 0.5605 0.9123 3.4683 1.6304 10.4644 4.7383 0.7077 48.7245 36.9840 89.2565 16.7051 17.9174 22.4110 1.2952 14.8247 0.7466 13.1977 9.1427 1.2448 4.1389 0.5010 3.1106 61.9676 63.6729 7.6200 55.1795 72.9356 47.3193 2.5432 1.1479 0.5653 2.5979 12.7038 1.7285 3.3508 3.0936 11.1379 4.5964 10.6778 2.2214 14.3649 32.1236 0.7474 6.2179 12.9339 15.4326 197.5692 1.9772 45.8083 23.2734 34.1188 46.8838 8.3110 49.2047 13.7650 6.7252 43.6956 10.1551 49.4057 20.1239
temp: 298.150 k
press: 1.00000 atm
elementType: 8 8 6 6 6 6 6 6 6 6 6 1 1 1 1 1 1 1 1 1 1 1 1
symmnumber: 1
zpe: 505053.7 jmol-1
zpe.correction: 0.192365 hartree
zpe.thermalcorrener: 0.201827 hartree
zpe.thermalcorrenthalpy: 0.202771 hartree
zpe.thermalcorrgfe: 0.157184 hartree
zpe.sumelectzpe: -499.759040 hartree
zpe.sumelectthermal: -499.749579 hartree
zpe.sumelectthermalent: -499.748635 hartree
zpe.sumelectthermalfe: -499.794221 hartree
dipole: -0.8652 -0.9722 -0.0562
dipole: 1.3026
quadrupole: -60.8639 -68.7290 -63.7849
quadrupole: -4.8415 1.0081 -2.0691
quadrupole: 3.5954 -4.2698 0.6744 -4.8415 1.0081 -2.0691
hfenergy: -499.9514053 hartree
pointgroup: C01 [X(C9H12O2)]
dipole: 0.362735 0.3501504 -0.0919226 debye
dipolederiv: -0.634329 0.4794221 -0.1870483 0.4763225 -0.9111733 0.1645435 -0.1434407 0.1141478 -0.4265587 -0.7699091 -0.2498339 0.0740442 -0.0034492 -0.8027143 0.1555525 0.0733934 0.1980175 -0.3511255 0.0979977 0.0276644 0.0180549 0.0123085 0.0790005 0.0066688 0.0309311 0.0054778 0.0743753 -0.3865673 -0.0127217 -0.0052361 -0.140096 -0.0388258 -0.0213373 -0.051835 -0.0089485 0.0319988 0.1170429 -0.0777744 0.0315133 -0.0303965 0.1379484 0.0612701 0.2199358 -0.0081487 0.0820675 0.098935 0.0078222 0.0311964 0.0074553 0.0317604 -0.0015254 0.0416694 -0.0230078 -0.0439686 0.0825272 0.0155231 0.017544 0.0104244 -0.0173338 -0.0143766 -0.0225162 0.0287527 0.0619212 0.0037133 -0.0666689 0.0254114 -0.0261537 0.0318981 -0.0636488 0.0200374 -0.0690489 0.133194 0.1316823 0.1459079 -0.1399201 0.0878218 -0.0653467 0.051946 -0.1511818 0.0842673 -0.1488538 0.0301458 0.0875423 -0.0347488 0.0783076 0.0804187 0.1407542 -0.0548798 0.1422965 -0.1568277 1.4037887 -0.1536099 0.0659289 -0.2904812 1.3048462 -0.3841863 -0.0902124 -0.3734183 0.2714274 0.0151949 -0.0949656 -0.0467418 -0.0659798 -0.0645948 -0.0864852 -0.0384919 -0.0637955 -0.0073219 0.0571696 0.0013393 0.0131144 0.0410209 0.0383743 0.0719981 0.0014544 0.0664015 -0.0694469 0.0102179 0.0805234 0.0303448 0.064107 -0.113772 -0.0391238 0.014332 -0.0310647 0.0523787 -0.1119062 0.1352813 -0.0710517 0.072996 0.0146167 0.0100247 -0.0370687 0.0065031 0.0415114 0.0048917 -0.1225837 0.0712313 -0.0724004 -0.0260812 0.0486945 0.0497018 0.0278851 0.0434572 -0.1198305 0.0311161 0.1535872 -0.0151775 0.0361484 0.0216665 0.1058009 -0.0177149 -0.0064568 -0.0260227 -0.0389085 -0.1462052 -0.0061657 0.0446138 -0.0486765 -0.1090537 -0.0334905 -0.0474436 0.0718102 -0.0553304 -0.0363957 -0.0176849 0.0493597 -0.0013072 0.0248719 -0.0361167 -0.200011 -0.0391437 0.0901659 -0.0232309 0.1149875 -0.1020467 -0.0054355 -0.0451602 0.0676183 0.0859 -0.0245932 -0.0980091 0.0143288 -0.1107615 -0.0532921 -0.079723 -0.0063296 -0.0924075 0.1198111 -0.1462592 -0.0733929 0.0870522 -0.0638906 0.0591331 -0.023425 0.0848579 -0.0174598 0.1092758 0.1334436 -0.0585091 0.0572269 -0.1231145 0.2870624 0.036132 0.0831839 0.0332544 0.3506959 unknown
polarizability: 104.7875545|-2.5648921|92.7475915|-6.8357513|3.1761131|82.1571009 unknown
InChI: InChI=1S/C9H12O2/c10-9(11)8-6-2-1-3-7(8)5-4-6/h1-2,6-8,10H,3-5H2
charge 0 multiplicity 1
23 atoms
O  -2.569609 1.296632 -0.573331
O  -2.5140 -0.90962 0.136604
C  0.356484 -1.117684 -0.433597
C  -0.410232 0.230257 -0.540476
C  0.317372 1.048591 0.583641
C  0.478754 -1.354937 1.110772
C  0.28474 0.049105 1.783206
C  1.746757 -0.926281 -1.098205
C  1.755452 1.27902 0.126334
C  2.407625 0.368489 -0.645914
C  -1.895496 0.095557 -0.282236
H  -0.188519 -1.944773 -0.920972
H  -0.281601 0.729905 -1.517772
H  -0.187534 2.004382 0.805054
H  1.463025 -1.789846 1.360081
H  -0.299494 -2.057211 1.452977
H  -0.68935 0.105502 2.304432
H  1.073995 0.273341 2.521249
H  1.655917 -0.93322 -2.20573
H  2.39839 -1.787237 -0.843788
H  2.260405 2.194299 0.46169
H  3.443369 0.551908 -0.963139
H  -3.540652 1.174523 -0.387678
