program: Gaussian 09
title: 000289876
version: EM64L-G09RevD.01
frameworkgroup: C1[X(C7H8Br2)]
method: RPBEPBE
basis: SDD
operation: Freq
keyword: #pfreq=noraman
keyword: PBEPBE/SDD
title: #p freq=noraman PBEPBE/SDD
converged: YES YES NO NO
title: Mulliken charges:
elementType: Br Br C C C C C C C H H H H H H H H
charge: -0.015861 -0.006827 -0.196886 -0.182640 -0.510245 -0.464172 -0.482890 -0.208065 -0.185147 0.282094 0.268454 0.264499 0.246595 0.342302 0.344788 0.249600 0.254403
chargesum: 0.00000
title: Mulliken charges with hydrogens summed into heavy atoms:
elementType: Br Br C C C C C C C
charge: -0.015861 -0.006827 0.085208 0.085814 0.000849 -0.121870 -0.138102 0.041535 0.069256
polarizability: 1.24591095e+02 3.02328683e+00 9.76353088e+01 -4.65918385e+00 -1.57316067e+00 7.39596780e+01
1716.lowfreq: -13.7038 -0.0005 -0.0005 -0.0004 11.3943 13.5441 73.4052 126.4109 153.3750
frequency: 73.3961 126.3863 153.3735 235.9809 239.4221 303.8724 445.7284 477.1408 575.4196 673.1953 724.1969 732.9947 758.3806 816.8167 866.7465 897.4712 905.7747 923.9667 937.9664 945.0387 973.6733 991.9552 1058.5710 1087.6094 1109.1924 1142.5139 1163.3472 1165.3644 1202.9074 1209.2547 1247.0436 1260.4498 1268.7636 1283.3866 1320.3708 1469.3614 1583.9808 3026.8727 3101.7987 3107.9098 3112.0017 3117.1446 3128.3083 3171.0001 3204.3780
redmass: 8.2233 6.3103 6.0518 4.2932 8.2743 4.5727 2.5736 2.2577 3.8895 4.6985 4.5266 1.6244 5.3486 3.5537 2.6019 2.3310 3.4266 1.6280 2.9551 1.8249 1.8061 1.8762 2.0578 1.1612 1.1712 1.3771 1.3447 1.1860 1.3762 1.2105 1.4629 1.4000 1.5290 1.4209 1.6997 1.0977 5.8412 1.0604 1.0894 1.1035 1.0896 1.0917 1.0911 1.0885 1.1095
irintensity: 0.9392 0.0221 1.2399 0.8460 5.4949 4.1076 1.1121 0.5148 32.0805 24.8237 48.1954 73.0042 14.5100 8.1283 2.7806 10.6426 1.3893 9.4249 2.0025 7.5602 0.5116 4.8355 5.7000 1.5553 3.8180 1.3903 17.5339 11.9005 6.1263 11.2464 17.6986 5.8610 12.9652 3.1344 19.5813 14.4063 0.7729 25.3539 6.3094 18.2085 23.6395 7.0107 1.1165 3.5334 10.8878
temp: 298.150 k
press: 1.00000 atm
elementType: 35 35 6 6 6 6 6 6 6 1 1 1 1 1 1 1 1
symmnumber: 1
zpe: 342852.3 jmol-1
zpe.correction: 0.130586 hartree
zpe.thermalcorrener: 0.138758 hartree
zpe.thermalcorrenthalpy: 0.139703 hartree
zpe.thermalcorrgfe: 0.095182 hartree
zpe.sumelectzpe: -297.754084 hartree
zpe.sumelectthermal: -297.745911 hartree
zpe.sumelectthermalent: -297.744967 hartree
zpe.sumelectthermalfe: -297.789488 hartree
dipole: 0.3627 2.8969 0.2903
dipole: 2.9339
quadrupole: -76.6981 -72.8124 -68.1705
quadrupole: 0.6102 -0.2125 -0.7404
quadrupole: -4.1378 -0.2520 4.3898 0.6102 -0.2125 -0.7404
hfenergy: -297.8846693 hartree
pointgroup: C01 [X(C7H8Br2)]
dipole: 0.949539 0.626118 0.1967204 debye
dipolederiv: -0.6957623 0.1783255 0.031606 0.1340307 -0.2276578 -0.0066889 0.1277799 -0.0186567 -0.1488419 -0.1522288 0.0150991 -0.0190345 0.0221712 -0.5957643 -0.1195309 -0.0180851 -0.1834051 -0.1905569 -0.1068422 0.0365314 0.0645901 0.1042172 0.124602 -0.0614122 0.1469391 -0.0264061 -0.0189949 -0.0119486 0.1324167 0.1458318 -0.0195959 -0.1378082 -0.1090887 0.0664027 -0.1143364 0.1244169 0.0442928 -0.0972927 -0.1291545 0.0337846 -0.0421336 0.053809 -0.0456745 0.0360656 -0.0009742 0.9996011 -0.2575066 -0.1255936 -0.1097461 0.08481 0.0475949 -0.2741812 -0.0776026 0.0414686 0.0503016 0.0434675 0.0147481 -0.0590264 0.8459379 0.2636252 0.1348547 0.4084165 0.1039856 -0.0880229 -0.1140287 -0.0948119 -0.2210317 -0.2016947 -0.0047802 -0.1532488 -0.0747825 0.0206326 -0.0954491 -0.063917 -0.1233514 -0.1029697 0.0096563 -0.0806545 -0.1872967 -0.0473928 -0.0521457 0.0514785 0.052099 -0.0295782 0.0466741 -0.0807684 0.0606441 -0.0265345 0.0597839 0.0519645 0.0197664 0.0237954 -0.0561675 0.0351969 0.0190247 0.0916745 -0.0576266 0.0775863 -0.0547479 -0.0357306 -0.0969908 -0.0659324 -0.0884359 -0.0474433 -0.0625566 -0.0380889 -0.0139459 0.0688374 -0.0170051 0.0430621 0.1454099 0.0188884 0.1014204 -0.0091722 0.1055229 -0.0280265 -0.0067473 -0.0820068 0.0472817 0.0393176 0.0137652 0.0321078 -0.0523062 -0.0088735 -0.0282544 -0.0088323 0.0070007 -0.0452387 0.071011 0.0172574 -0.0757976 -0.0544912 0.0441617 -0.0444303 0.0105453 0.0657176 0.0322021 0.0697339 0.0360425 0.1342673 0.0458315 0.1008841 0.0665561 -0.0402947 0.0468376 0.070694 0.0613754 0.1387776 0.0572416 -0.0024975 0.0830647 0.008831 0.100285 unknown
polarizability: 112.4482616|-13.2837581|108.9299484|-5.2795134|6.2068032|74.8078723 unknown
InChI: InChI=1S/C7H8Br2/c8-6-4-1-2-5(3-4)7(6)9/h1-2,4-7H,3H2
charge 0 multiplicity 1
17 atoms
Br -2.845823 0.801466 0.02027
Br -0.25423 -2.74162 -0.385465
C  0.083974 1.330969 -0.371952
C  0.91623 -0.314101 0.979912
C  0.475831 1.182874 1.132504
C  -0.967877 0.174794 -0.517085
C  -0.443854 -0.908526 0.479542
C  1.347947 0.771885 -1.048602
C  1.846452 -0.207657 -0.240501
H  -0.275653 2.306975 -0.722646
H  1.316322 -0.825182 1.866203
H  1.316829 1.834754 1.417053
H  -0.37339 1.333416 1.822145
H  -1.111382 -0.182469 -1.544769
H  -1.145581 -1.099206 1.303457
H  1.693997 1.057656 -2.044885
H  2.68471 -0.87783 -0.440981
