program: Gaussian 09
title: 000289875
version: EM64L-G09RevD.01
frameworkgroup: C1[X(C8H12Br2)]
method: RPBEPBE
basis: SDD
operation: Freq
keyword: #pfreq=noraman
keyword: PBEPBE/SDD
title: #p freq=noraman PBEPBE/SDD
converged: NO YES NO NO
title: Mulliken charges:
elementType: Br Br C C C C C C C C H H H H H H H H H H H H
charge: -0.024458 -0.024458 -0.092712 -0.092712 -0.483848 -0.483848 -0.480725 -0.427655 -0.427655 -0.480724 0.253581 0.253581 0.330941 0.330942 0.224096 0.236586 0.248217 0.215976 0.248217 0.215976 0.224097 0.236585
chargesum: 0.00000
title: Mulliken charges with hydrogens summed into heavy atoms:
elementType: Br Br C C C C C C C C
charge: -0.024458 -0.024458 0.160869 0.160868 -0.152907 -0.152907 -0.020042 0.036538 0.036538 -0.020042
polarizability: 1.29363529e+02 -7.40548929e-04 1.18927693e+02 -7.27612030e+00 -2.77581162e-03 8.62515180e+01
1716.lowfreq: -29.6493 -17.9947 -10.2978 0.0001 0.0004 0.0004 1.0213 108.1329 136.6118
frequency: -24.8374 108.1104 136.5995 174.3628 221.3150 230.5279 251.2730 299.8693 377.4744 499.4324 513.1828 590.9741 623.4448 732.7521 787.2249 794.7972 811.3415 822.7686 870.4288 882.6111 942.5230 943.0375 969.7584 1031.5195 1055.7233 1066.7210 1084.7588 1102.9790 1149.1280 1153.6549 1154.3798 1192.2575 1203.6744 1221.8087 1228.9837 1269.4835 1270.7691 1271.9885 1310.5681 1310.9516 1322.0598 1330.5237 1352.7904 1353.2880 1459.9022 1468.3600 1475.5669 1488.8177 2989.1354 2989.7797 3007.0411 3007.4087 3040.4944 3040.8817 3042.7351 3046.9155 3066.9799 3072.0860 3091.6544 3093.8500
redmass: 3.8000 8.7248 5.9927 2.1803 2.7187 6.5023 3.7830 2.3721 2.3754 4.9187 3.7615 5.6421 7.1171 3.7181 1.2770 3.5702 1.6409 2.6391 2.6074 2.4824 1.7459 4.0446 2.8278 1.7482 2.4102 1.9873 2.1292 1.4380 1.0842 1.0715 1.0842 1.6757 1.1780 1.2235 1.1539 1.5712 1.5998 1.3469 1.4636 1.3272 1.5974 1.4417 1.4458 1.4312 1.0742 1.0771 1.0858 1.0877 1.0598 1.0592 1.0638 1.0626 1.1021 1.0857 1.1027 1.0875 1.1032 1.1033 1.0892 1.0869
irintensity: 0.3810 0.3193 1.0010 0.8076 0.3376 5.1478 4.3993 3.1262 2.2864 0.8096 0.6087 53.3636 8.1566 42.2273 0.1196 0.0251 27.3362 2.6924 1.9831 0.0132 1.3935 41.9150 1.7064 2.7858 6.3031 0.0893 1.0368 0.0664 29.1683 0.8637 1.8552 1.4963 0.6528 13.0454 0.0417 0.3287 29.2284 7.0404 6.0702 0.0156 0.7717 3.3826 0.3137 8.4288 0.0658 9.4942 19.1784 10.8590 55.4321 0.5458 38.6660 52.7792 5.7063 62.3437 0.3305 10.0709 22.2520 57.6053 0.3087 4.8103
temp: 298.150 k
press: 1.00000 atm
elementType: 35 35 6 6 6 6 6 6 6 6 1 1 1 1 1 1 1 1 1 1 1 1
symmnumber: 1
zpe: 480919.3 jmol-1
zpe.correction: 0.183172 hartree
zpe.thermalcorrener: 0.192071 hartree
zpe.thermalcorrenthalpy: 0.193015 hartree
zpe.thermalcorrgfe: 0.147371 hartree
zpe.sumelectzpe: -338.193151 hartree
zpe.sumelectthermal: -338.184252 hartree
zpe.sumelectthermalent: -338.183308 hartree
zpe.sumelectthermalfe: -338.228952 hartree
dipole: 0.0000 3.8153 0.0000
dipole: 3.8153
quadrupole: -85.8832 -78.7907 -76.6648
quadrupole: 0.0000 -0.2565 0.0000
quadrupole: -5.4370 1.6556 3.7814 0.0000 -0.2565 0.0000
hfenergy: -338.3763232 hartree
pointgroup: C01 [X(C8H12Br2)]
dipole: -1.5010492 0.0000205 -0.0000025 debye
dipolederiv: -0.4056963 0.2570045 -0.086449 0.2641737 -0.5033738 0.0701124 -0.1463585 0.1207212 -0.1941913 -0.4057211 -0.2569967 0.0864216 -0.2641396 -0.5033142 0.0700638 0.1463633 0.1207202 -0.1941792 0.0646688 0.0920623 -0.0207871 0.194411 -0.1107392 0.0857733 -0.1417753 0.0689127 0.0480553 0.0647026 -0.0920232 0.0207853 -0.1943464 -0.1107489 0.0857693 0.141804 0.0689794 0.0480211 0.4292628 -0.5639257 0.1744478 -0.4611476 0.5502835 -0.1336556 0.2866291 -0.1786487 0.118349 0.4291706 0.563904 -0.1744313 0.4611028 0.5503058 -0.1336992 -0.2865722 -0.1787407 0.1183782 -0.012893 0.1071221 -0.0649993 -0.0874453 0.0978936 -0.0355466 0.0102755 0.036132 0.1031473 0.0680452 0.002814 0.0473835 0.0201255 0.0878971 0.0028813 0.0316055 0.0021348 -0.0186935 0.0680962 -0.0028147 -0.0473557 -0.0200003 0.08791 0.0028775 -0.0316141 0.0022025 -0.018727 -0.0129323 -0.1071441 0.0650177 0.0874751 0.0978936 -0.035533 -0.0102623 0.0361598 0.1031243 0.0407613 -0.0062412 0.0178591 -0.0127779 -0.0868711 -0.102827 0.0135619 -0.0997767 -0.0172544 0.0407585 0.0062375 -0.0178694 0.0127362 -0.0868893 -0.1028151 -0.0136154 -0.0997948 -0.017242 0.0032897 0.0770836 -0.0079723 0.0237242 -0.0263575 0.0740759 0.0314933 0.0375233 -0.0232439 0.0033013 -0.0771069 0.0079864 -0.0237587 -0.0263671 0.0740873 -0.0315299 0.0375258 -0.0232303 -0.1624643 -0.043334 -0.1018483 -0.0171466 -0.0008784 -0.0318765 -0.0549503 -0.0096928 0.0525224 0.0521089 -0.0146333 0.1368186 -0.0268951 0.0344235 0.0351035 0.0704136 0.0095039 -0.1246569 0.0866003 0.0920081 -0.0528305 0.027942 -0.0794653 0.0612354 -0.0296971 0.0681576 0.0023783 -0.1636487 -0.0945386 -0.0317326 -0.0458313 0.0371792 -0.0252567 -0.0476795 -0.0549532 0.0535777 0.086544 -0.092016 0.0528223 -0.0280297 -0.0795099 0.0612638 0.0297213 0.0681353 0.0023859 -0.163642 0.0945603 0.0317146 0.045836 0.0371797 -0.0252594 0.0476777 -0.0549705 0.0535879 -0.1624254 0.0433571 0.1018329 0.0171229 -0.0008638 -0.0318911 0.0549309 -0.0096886 0.0525214 0.0521129 0.0146208 -0.1368141 0.0268691 0.0344123 0.0351169 -0.0704215 0.0094575 -0.1246304 unknown
polarizability: 118.9276935|0.0012092|126.8664347|0.0025456|-12.4242179|88.7486119 unknown
InChI: InChI=1S/C8H12Br2/c9-7-5-1-2-6(4-3-5)8(7)10/h5-8H,1-4H2
charge 0 multiplicity 1
22 atoms
Br 2.074757 -2.126907 0.277899
Br 2.074815 2.126847 -0.277872
C  -0.534535 -1.083301 -0.735864
C  -0.534508 1.083311 0.735883
C  0.911999 -0.60521 -0.48229
C  0.912014 0.605181 0.482314
C  -1.249276 0.080288 -1.491941
C  -1.277023 -1.361468 0.594118
C  -1.276984 1.361499 -0.594103
C  -1.249284 -0.080258 1.491957
H  -0.512718 -1.98812 -1.368735
H  -0.512668 1.98813 1.368753
H  1.425428 -0.385845 -1.429953
H  1.425434 0.385803 1.429978
H  -2.273409 -0.249257 -1.74663
H  -0.732067 0.284139 -2.448315
H  -0.804425 -2.215175 1.110604
H  -2.316324 -1.658587 0.362284
H  -0.80436 2.215192 -1.110587
H  -2.316277 1.658647 -0.362272
H  -2.273408 0.249315 1.746643
H  -0.732082 -0.284124 2.448332
