program: Gaussian 09
title: 000289872
version: EM64L-G09RevD.01
frameworkgroup: C1[X(C15H10ClNO4)]
method: RPBEPBE
basis: SDD
operation: Freq
keyword: #p
keyword: freq=noraman
keyword: PBEPBE/SDD
title: #p freq=noraman PBEPBE/SDD
converged: YES YES NO NO
title: Mulliken charges:
elementType: Cl O O O O N C C C C C C C C C C C C C C C H H H H H H H H H H
charge: -0.060144 -0.408281 -0.239569 -0.198905 -0.203233 0.023237 0.305209 0.188269 0.375110 -0.334633 0.170030 -0.293718 -0.366741 -0.372411 -0.373539 -0.242504 -0.209385 -0.106706 -0.211406 0.060298 -0.242770 0.272208 0.281575 0.301059 0.235588 0.287993 0.243518 0.244833 0.233489 0.259467 0.382060
chargesum: 0.00000
title: Mulliken charges with hydrogens summed into heavy atoms:
elementType: Cl O O O O N C C C C C C C C C C C C C C C
charge: -0.060144 -0.026221 -0.239569 -0.198905 -0.203233 0.023237 0.305209 0.188269 0.375110 -0.062425 0.170030 -0.012143 -0.065682 -0.136823 -0.085545 0.001013 0.035448 -0.106706 0.022083 0.060298 0.016697
polarizability: 3.13818138e+02 -8.00848956e+00 2.22896625e+02 9.80074205e+00 1.57551161e+01 9.98983656e+01
1716.lowfreq: -7.9755 -4.5945 -1.1456 -0.0021 -0.0015 0.0011 17.4189 26.3202 37.3880
frequency: 17.3198 26.2820 37.3837 40.5273 63.7949 67.1413 99.8205 132.5919 160.9558 179.0600 200.4091 223.1171 247.8764 274.0316 289.4038 355.2868 377.9893 390.3207 402.9922 428.8207 438.5861 447.2264 492.4645 507.6146 549.9170 565.3027 599.3026 625.3048 644.6557 654.0094 666.1834 688.7634 698.5945 718.3501 750.6213 761.2398 780.0829 784.4547 792.0058 839.2665 869.7774 894.0054 904.8252 919.1602 973.3946 976.5677 979.7206 990.7243 1001.1050 1039.0429 1049.3792 1064.3232 1079.3582 1096.2590 1137.1140 1173.0850 1183.2650 1200.5732 1209.0255 1248.6385 1275.2600 1294.2027 1303.1206 1341.8409 1360.3628 1373.9511 1386.1332 1419.6517 1430.9283 1461.4223 1471.6020 1565.4902 1568.4449 1600.0271 1604.7615 1611.7415 1626.6775 3117.7735 3140.8698 3146.9920 3159.9995 3162.0703 3165.7485 3177.5199 3187.0316 3202.8114 3510.1520
redmass: 9.6104 10.4778 10.0127 9.1268 7.8239 7.5561 5.4360 9.1688 5.1993 5.8493 5.8959 5.8682 8.9809 6.3855 6.7160 8.4407 6.7836 5.6268 6.2307 3.6669 3.9335 3.7154 5.6929 3.6780 5.1897 5.0321 3.6158 1.5752 5.3694 6.6670 5.4001 3.8796 2.5576 4.8201 5.4104 5.9275 3.0385 2.0722 1.5704 4.2989 1.3817 1.4467 1.3733 1.5360 1.5407 1.4281 3.9376 4.8757 1.3438 3.0527 2.8348 2.5960 2.0471 1.6244 2.0555 1.1896 1.1038 3.4528 2.7473 2.3039 1.8119 1.6544 1.4023 2.8298 4.6655 6.1637 3.8868 2.8829 2.5116 2.4193 2.5836 6.2113 6.2393 6.8904 6.6976 8.4860 8.0314 1.0871 1.0869 1.0876 1.0934 1.0934 1.0934 1.0984 1.0960 1.0955 1.0640
irintensity: 0.8233 1.7673 0.3275 0.4859 0.7535 2.5005 0.3981 2.7672 1.2099 0.5825 0.3608 1.2191 0.6451 3.0168 3.8352 0.7145 2.4814 0.6646 5.6165 1.7847 7.0386 3.0315 14.4583 17.0903 5.2331 31.8060 29.7041 86.5220 6.4272 9.4792 19.8452 15.9484 56.0829 25.2242 10.7697 14.2273 8.2649 34.0679 49.4603 12.2930 9.7536 4.0815 7.8922 6.7194 2.4427 3.6142 17.6404 22.2889 0.7306 2.4081 286.2677 89.0252 12.6110 4.7964 10.4334 23.6226 0.6152 144.0887 58.8798 20.7707 10.2738 10.0589 3.2877 261.5633 72.1909 8.2738 5.8039 24.1569 4.8437 35.8645 41.7053 5.7688 76.2285 20.3256 16.4754 95.7538 62.3576 0.9939 7.3944 3.8747 5.9367 5.5225 15.7055 10.0567 5.1967 2.7901 48.7935
temp: 298.150 k
press: 1.00000 atm
elementType: 17 8 8 8 8 7 6 6 6 6 6 6 6 6 6 6 6 6 6 6 6 1 1 1 1 1 1 1 1 1 1
symmnumber: 1
zpe: 566282.3 jmol-1
zpe.correction: 0.215686 hartree
zpe.thermalcorrener: 0.233990 hartree
zpe.thermalcorrenthalpy: 0.234934 hartree
zpe.thermalcorrgfe: 0.165920 hartree
zpe.sumelectzpe: -1391.746640 hartree
zpe.sumelectthermal: -1391.728336 hartree
zpe.sumelectthermalent: -1391.727392 hartree
zpe.sumelectthermalfe: -1391.796406 hartree
dipole: -2.0631 -4.9177 -2.0541
dipole: 5.7149
quadrupole: -107.0709 -131.4956 -126.2114
quadrupole: -5.4269 3.6474 -4.3529
quadrupole: 14.5218 -9.9030 -4.6188 -5.4269 3.6474 -4.3529
hfenergy: -1391.9623258 hartree
pointgroup: C01[X(C15H10Cl1N1O4)]
dipole: 0.7089061 -2.1063073 0.3409202 debye
polarizability: 314.7596164|1.0676492|223.4028952|3.9703857|11.2347573|98.450617 unknown
InChI: InChI=1S/C15H10ClNO4/c16-12-6-3-5-10(8-12)13(15(18)19)9-11-4-1-2-7-14(11)17(20)21/h1-9,18H
charge 0 multiplicity 1
31 atoms
Cl -4.312813 2.68303 0.858972
O  -1.207055 -2.012748 -2.225665
O  0.834868 -2.615693 -1.32102
O  2.847501 3.251811 -0.19875
O  0.789145 2.288326 -0.238171
N  2.075521 2.224294 -0.08699
C  1.886045 -0.258347 0.395821
C  -0.559373 -0.922094 -0.188319
C  -2.00203 -0.632283 0.078847
C  0.406364 -0.198847 0.474462
C  2.692051 0.909699 0.219047
C  2.581169 -1.473906 0.643393
C  -2.427504 0.707924 0.294677
C  -2.958575 -1.679642 0.158248
C  4.104172 0.876093 0.278184
C  3.988533 -1.519309 0.710497
C  4.755857 -0.344295 0.529074
C  -3.776917 0.957515 0.598475
C  -4.304741 -1.400077 0.468509
C  -0.209436 -1.920715 -1.243989
C  -4.732954 -0.071175 0.695483
H  0.025123 0.546094 1.183817
H  1.999424 -2.385462 0.785982
H  -1.724057 1.539172 0.184926
H  -2.647332 -2.713984 -0.01796
H  4.657772 1.8047 0.118764
H  4.485686 -2.475583 0.903068
H  5.848553 -0.380258 0.577373
H  -5.031603 -2.216224 0.535866
H  -5.776217 0.156287 0.931805
H  -0.912581 -2.667706 -2.916024
