program: Gaussian 09
title: 000289871
version: EM64L-G09RevD.01
frameworkgroup: C1[X(C15H10ClNO4)]
method: RPBEPBE
basis: SDD
operation: Freq
keyword: #p
keyword: freq=noraman
keyword: PBEPBE/SDD
title: #p freq=noraman PBEPBE/SDD
converged: YES YES NO NO
title: Mulliken charges:
elementType: Cl O O O O N C C C C C C C C C C C C C C C H H H H H H H H H H
charge: -0.059894 -0.406909 -0.238136 -0.200877 -0.207461 0.021923 0.302175 0.183742 0.445992 -0.324258 0.173300 -0.294908 -0.314027 -0.379683 -0.372772 -0.242217 -0.209008 -0.232410 -0.236221 0.082999 -0.224805 0.272768 0.287219 0.286559 0.287044 0.244078 0.244379 0.256195 0.236798 0.236831 0.381583
chargesum: 0.00000
title: Mulliken charges with hydrogens summed into heavy atoms:
elementType: Cl O O O O N C C C C C C C C C C C C C C C
charge: -0.059894 -0.025325 -0.238136 -0.200877 -0.207461 0.021923 0.302175 0.183742 0.445992 -0.051490 0.173300 -0.007689 -0.314027 -0.093124 -0.085727 0.001860 0.035371 0.023785 0.000577 0.082999 0.012027
polarizability: 2.98413424e+02 1.50010261e+01 2.23655985e+02 5.42947455e+00 1.12479492e+01 9.92021486e+01
1716.lowfreq: -7.5804 -3.1008 -0.0013 0.0006 0.0016 3.4629 20.0195 28.0224 46.4881
frequency: 20.0013 27.9894 46.4854 55.8149 65.2883 78.9460 95.0006 122.7522 153.8439 159.8090 180.6612 226.9904 250.2904 286.6755 314.8562 331.0644 376.6638 392.6772 415.6150 430.0595 448.9747 465.7131 489.5376 503.6541 545.8612 564.9277 590.1209 614.1962 638.4944 652.5267 665.8202 686.4694 713.3283 724.9729 746.5830 759.3168 766.9245 780.6132 784.5499 839.4689 867.1903 880.8510 897.4107 955.4554 964.3154 976.1482 990.9024 1001.0639 1021.0952 1037.5667 1045.6538 1054.6822 1064.8757 1124.8903 1137.4398 1173.4117 1174.4385 1200.9910 1208.5801 1243.3989 1267.9177 1282.3265 1300.4862 1347.0645 1361.7479 1367.7776 1386.6481 1422.9063 1430.6597 1459.9203 1471.3863 1566.3991 1568.0971 1600.7830 1605.8199 1619.7748 1632.6931 3114.1168 3137.5484 3147.5472 3148.5327 3163.3732 3166.0220 3176.5282 3187.2929 3202.1445 3520.2111
redmass: 9.2522 9.5098 7.8970 9.1317 7.5012 8.8192 5.3433 11.7736 5.4905 5.1905 6.7208 6.1602 8.2547 5.6071 9.0573 8.3024 6.4882 4.5037 9.1388 3.7372 3.6762 4.0255 5.2452 3.5482 4.6481 4.5121 3.7087 1.5837 5.8562 6.8598 5.3995 5.2180 4.5347 5.2525 3.6749 3.5262 1.6646 5.3492 1.5658 4.7922 1.3365 1.4086 1.5181 1.5810 3.3220 1.4579 1.3411 1.3444 6.0911 2.9297 2.6405 2.3582 2.4012 1.6949 2.0425 1.1671 1.0740 2.9269 3.1076 2.1153 1.6435 1.8488 1.5520 4.0449 4.6210 4.2762 3.8824 2.3305 2.5145 2.5107 2.6525 6.0416 6.1861 6.8190 7.0479 9.2112 8.3268 1.0876 1.0860 1.0875 1.0910 1.0955 1.0935 1.0997 1.0959 1.0958 1.0641
irintensity: 1.5472 0.8584 2.2524 2.8774 0.4787 1.7236 0.2596 0.4139 0.1320 0.7847 0.1898 0.4679 9.7512 0.3787 0.9724 0.2857 2.6161 2.1151 6.1738 1.7980 3.6823 7.2465 12.6216 14.4284 0.5333 37.8019 36.5180 85.3191 7.3474 20.5089 19.7586 12.0418 10.1976 7.5286 16.8504 31.5564 36.8718 21.7417 59.3032 1.7696 2.7664 2.5706 4.4576 3.3020 6.4077 7.9633 0.2524 0.8967 41.2072 27.0623 150.8214 96.5658 112.7262 3.9633 8.6359 23.6831 3.6101 137.3399 76.5242 1.2760 4.7383 4.0595 3.3507 318.2886 8.5169 9.7863 6.1228 23.5049 3.3440 36.1062 44.4085 20.5245 10.7852 5.9728 0.6549 94.3735 81.4786 0.9774 1.3938 3.7048 5.1027 9.3283 15.2207 16.2427 4.9126 2.4295 50.1640
temp: 298.150 k
press: 1.00000 atm
elementType: 17 8 8 8 8 7 6 6 6 6 6 6 6 6 6 6 6 6 6 6 6 1 1 1 1 1 1 1 1 1 1
symmnumber: 1
zpe: 566369.7 jmol-1
zpe.correction: 0.215719 hartree
zpe.thermalcorrener: 0.233991 hartree
zpe.thermalcorrenthalpy: 0.234935 hartree
zpe.thermalcorrgfe: 0.166690 hartree
zpe.sumelectzpe: -1391.746307 hartree
zpe.sumelectthermal: -1391.728035 hartree
zpe.sumelectthermalent: -1391.727090 hartree
zpe.sumelectthermalfe: -1391.795335 hartree
dipole: 0.0628 -1.6930 -1.0941
dipole: 2.0168
quadrupole: -107.5006 -129.7067 -125.1310
quadrupole: 18.3830 4.6516 -2.8158
quadrupole: 13.2788 -8.9273 -4.3515 18.3830 4.6516 -2.8158
hfenergy: -1391.9620254 hartree
pointgroup: C01 [X(C15H10Cl1N1O4)]
dipole: -0.0776494 0.7310708 0.2984575 debye
polarizability: 301.0671088|-4.0361581|220.2997855|-8.6475708|-13.0231895|99.9046633 unknown
InChI: InChI=1S/C15H10ClNO4/c16-13-7-3-2-6-11(13)12(15(18)19)9-10-5-1-4-8-14(10)17(20)21/h1-9,18H
charge 0 multiplicity 1
31 atoms
Cl 2.989502 2.741932 0.16766
O  1.562966 1.199957 -2.430244
O  -0.369632 2.232273 -1.678875
O  -3.213754 -3.066942 0.321331
O  -1.044219 -2.435701 0.073091
N  -2.299514 -2.159182 0.246544
C  -1.734489 0.309959 0.367046
C  0.765418 0.541576 -0.279054
C  2.14867 0.060139 0.021124
C  -0.278648 0.045824 0.463349
C  -2.707819 -0.737161 0.354378
C  -2.234829 1.639339 0.430197
C  3.247954 0.930822 0.221325
C  2.402022 -1.335709 0.1312
C  -4.098252 -0.483729 0.397039
C  -3.618534 1.904791 0.47628
C  -4.555609 0.844332 0.461142
C  4.543822 0.466359 0.507053
C  3.692898 -1.825958 0.419508
C  0.562545 1.416963 -1.474604
C  4.767141 -0.926357 0.603374
H  0.006121 -0.655395 1.257922
H  -1.51998 2.463238 0.444657
H  1.572325 -2.030115 -0.04011
H  -4.787364 -1.331435 0.370951
H  -3.964303 2.942531 0.522367
H  -5.629858 1.050858 0.493198
H  5.359393 1.178788 0.660149
H  3.860136 -2.905652 0.489612
H  5.773767 -1.297527 0.822573
H  1.410324 1.813783 -3.198882
