program: Gaussian 09
title: 000289869
version: EM64L-G09RevD.01
frameworkgroup: C1[X(C14H15ClN4O)]
method: RPBEPBE
basis: SDD
operation: Freq
keyword: #p
keyword: freq=noraman
keyword: PBEPBE/SDD
title: #p freq=noraman PBEPBE/SDD
converged: YES YES NO NO
title: Mulliken charges:
elementType: Cl O N N N N C C C C C C C C C C C C C C H H H H H H H H H H H H H H H
charge: -0.052127 -0.244235 -0.061923 -0.125193 -0.637769 -0.591686 0.296510 -0.327212 -0.020978 0.492246 -0.707281 -0.740531 0.087203 0.114741 -0.399341 -0.427740 -0.054123 -0.228745 -0.211434 -0.126462 0.231782 0.239373 0.222078 0.235413 0.234832 0.215987 0.238810 0.273937 0.242024 0.258881 0.255771 0.336993 0.324222 0.324433 0.331546
chargesum: 0.00000
title: Mulliken charges with hydrogens summed into heavy atoms:
elementType: Cl O N N N N C C C C C C C C C C C C C C
charge: -0.052127 -0.244235 -0.061923 -0.125193 0.023446 0.064293 0.296510 -0.095430 -0.020978 0.492246 -0.010417 -0.050903 0.087203 0.114741 -0.125404 -0.185716 -0.054123 0.030136 0.044337 -0.126462
polarizability: 2.76603271e+02 3.82352012e+00 1.81033798e+02 1.41260311e+01 9.05782030e+00 1.28036546e+02
1716.lowfreq: -10.5759 -0.0022 -0.0020 -0.0013 2.3945 5.4393 33.0492 39.7168 57.5654
frequency: 33.0092 39.7017 57.4940 67.8127 108.1045 153.0339 180.6679 191.3864 208.5002 219.8105 230.3275 245.3614 255.0400 278.5329 292.9581 319.5111 323.3206 330.3613 403.6228 411.9690 425.4329 434.0070 440.4443 444.5632 485.7916 506.8523 522.4111 530.1838 559.1476 574.3858 595.6667 623.9038 653.2911 671.1526 684.1609 705.3396 710.9840 752.7687 761.5731 800.1102 819.3439 836.7524 848.8833 861.6152 926.7386 930.3604 950.9896 968.4848 982.7358 994.3034 1000.8906 1010.6086 1072.6351 1078.2260 1105.7370 1128.6189 1146.5127 1166.9900 1182.9165 1189.1672 1221.9390 1229.0874 1277.7842 1293.0903 1308.4672 1331.0307 1372.9565 1377.8559 1381.1915 1395.6370 1399.6998 1423.6699 1452.2734 1461.8826 1470.8580 1475.8682 1482.4893 1484.5291 1561.5181 1581.2749 1586.3698 1598.2059 1601.3620 1622.4182 2930.9239 2987.9058 2995.5124 3084.6571 3095.7498 3097.1136 3101.3708 3123.4625 3137.0369 3167.2092 3170.0394 3543.1762 3564.7220 3697.6616 3725.4353
redmass: 5.0693 6.1695 4.6749 4.0721 5.6886 6.2965 3.7896 5.4066 1.1512 6.2404 3.2726 3.2916 1.4104 3.0322 3.0829 4.6349 3.2284 3.5585 5.0013 2.6971 1.3720 2.6247 1.6532 2.2539 4.2974 3.3094 1.0865 1.0663 3.8819 5.7472 4.5620 7.0860 9.3703 6.7184 6.6179 8.1326 4.9289 4.3722 7.8048 3.0749 6.0170 1.4210 1.5923 4.4738 2.4808 1.4427 1.4469 1.7453 1.3935 1.6653 3.7546 2.3516 2.7459 3.0685 1.3827 2.0397 2.1990 1.9576 1.1449 3.5734 2.1458 2.3574 2.0349 1.8108 1.6523 5.7100 5.8433 4.8696 1.3441 1.2979 2.3013 5.5662 1.0573 1.0528 1.0720 2.3466 1.2564 1.9986 3.6291 6.9768 4.4863 5.3968 1.6542 1.7739 1.0827 1.0358 1.0358 1.0987 1.1001 1.1003 1.0998 1.0898 1.0895 1.0949 1.0960 1.0445 1.0440 1.1049 1.1060
irintensity: 0.9456 0.6686 0.7098 1.0310 0.7787 0.5036 1.0307 7.9244 0.0336 2.7923 1.7458 1.1947 0.5439 1.2168 3.2018 0.9660 3.7543 3.9991 11.4197 7.2071 85.8379 4.4399 219.5011 186.5835 4.9595 15.2971 58.1546 11.6015 3.5302 4.8059 0.7897 0.1491 0.4703 9.8508 5.8129 3.4252 0.6117 3.0168 22.1311 88.3103 6.6713 10.0667 21.7217 3.3753 20.2184 1.4792 4.6540 5.9354 1.2689 5.3723 39.7572 13.2835 50.7877 143.7669 7.1838 6.4160 13.7695 26.2540 2.1163 15.4597 42.9091 16.6175 8.3647 15.4070 12.7210 10.0588 120.9745 39.2783 29.3303 21.2326 9.2779 265.0916 1.5293 3.6035 7.9120 117.1729 44.7156 21.8527 287.3957 75.1619 153.7892 25.1218 713.6231 348.7978 28.9170 16.4769 12.1186 16.0270 14.6883 20.7137 37.8345 10.2421 4.0664 4.9836 0.9495 66.8235 129.6246 54.6087 45.8938
temp: 298.150 k
press: 1.00000 atm
elementType: 17 8 7 7 7 7 6 6 6 6 6 6 6 6 6 6 6 6 6 6 1 1 1 1 1 1 1 1 1 1 1 1 1 1 1
symmnumber: 1
zpe: 713265.3 jmol-1
zpe.correction: 0.271668 hartree
zpe.thermalcorrener: 0.290033 hartree
zpe.thermalcorrenthalpy: 0.290977 hartree
zpe.thermalcorrgfe: 0.225415 hartree
zpe.sumelectzpe: -1295.373757 hartree
zpe.sumelectthermal: -1295.355392 hartree
zpe.sumelectthermalent: -1295.354448 hartree
zpe.sumelectthermalfe: -1295.420011 hartree
dipole: 1.2050 -0.8378 1.4089
dipole: 2.0344
quadrupole: -132.4777 -116.0047 -120.4934
quadrupole: 13.0957 4.4828 3.6250
quadrupole: -9.4858 6.9872 2.4985 13.0957 4.4828 3.6250
hfenergy: -1295.6454254 hartree
pointgroup: C01 [X(C14H15Cl1N4O1)]
dipole: 0.4509199 -0.3454922 0.5638621 debye
polarizability: 275.5324781|2.0416114|180.612971|19.3221205|9.9150501|129.5281663 unknown
InChI: InChI=1S/C14H15ClN4O/c1-14(2)10(7-3-5-8(15)6-4-7)9-11(16)18-13(17)19-12(9)20-14/h3-6,10H,16-17H2,1-2H3
charge 0 multiplicity 1
35 atoms
Cl 5.735723 -1.079497 -0.249064
O  -1.925545 2.028074 -0.287915
N  -3.473712 0.239215 -0.543223
N  -2.730612 -1.986741 0.211797
N  -0.620681 -2.359484 1.148195
N  -4.867015 -1.635199 -0.675104
C  -0.429308 2.157273 0.012924
C  -0.058359 0.799887 0.773931
C  -1.204013 -0.101297 0.353613
C  1.361166 0.30294 0.518812
C  0.254738 2.319997 -1.353281
C  -0.273972 3.395507 0.899546
C  -2.25384 0.677654 -0.182644
C  -1.50479 -1.47122 0.569939
C  1.668814 -0.576015 -0.552489
C  2.420927 0.736192 1.35761
C  -3.642789 -1.115653 -0.320328
C  2.994232 -0.999185 -0.794803
C  3.753771 0.327036 1.131822
C  4.020065 -0.536203 0.051567
H  -0.14084 1.01153 1.862856
H  -0.176146 3.193617 -1.871143
H  1.341577 2.475597 -1.236929
H  0.09601 1.431387 -1.987903
H  -0.863939 3.290443 1.826244
H  0.788852 3.54029 1.168033
H  -0.622073 4.29792 0.368211
H  0.862622 -0.934428 -1.202368
H  2.205056 1.399694 2.20414
H  3.223021 -1.676137 -1.623057
H  4.564209 0.666993 1.782987
H  0.337895 -2.092924 1.355801
H  -0.922435 -3.325159 1.259071
H  -5.049666 -2.623292 -0.527763
H  -5.568143 -1.012308 -1.065782
