program: Gaussian 09
title: 000289865
version: EM64L-G09RevD.01
frameworkgroup: C1[X(C12H23NO3)]
method: RPBEPBE
basis: SDD
operation: Freq
keyword: #p
keyword: freq=noraman
keyword: PBEPBE/SDD
title: #p freq=noraman PBEPBE/SDD
converged: YES YES NO NO
title: Mulliken charges:
elementType: O O O N C C C C C C C C C C C C H H H H H H H H H H H H H H H H H H H H H H H
charge: -0.458922 -0.295249 -0.441333 -0.384192 -0.038860 -0.426012 -0.458459 -0.399408 -0.410189 -0.378194 0.356943 -0.240545 0.153238 -0.435074 -0.732650 -0.813703 0.253954 0.248714 0.198192 0.208948 0.212843 0.201624 0.208870 0.213697 0.180446 0.196108 0.205927 0.222710 0.310804 0.223663 0.246691 0.192739 0.240726 0.258218 0.239223 0.207682 0.225512 0.368092 0.337226
chargesum: 0.00000
title: Mulliken charges with hydrogens summed into heavy atoms:
elementType: O O O N C C C C C C C C C C C C
charge: -0.090830 -0.295249 -0.104107 -0.073388 0.215094 0.020894 -0.036669 0.011085 -0.016045 0.023841 0.356943 -0.017835 0.153238 0.035280 -0.040967 -0.141285
polarizability: 1.67377323e+02 -4.82510760e+00 1.37315362e+02 -2.45601861e+00 -4.27814412e+00 1.24654184e+02
1716.lowfreq: -12.7056 -6.1474 -0.0008 -0.0006 -0.0005 1.7672 24.5843 36.4194 49.4991
frequency: 21.1845 34.6596 48.9788 65.2341 93.8675 99.4483 148.5254 174.6778 191.4631 214.5928 236.0521 245.3250 273.8488 281.7444 300.7062 327.5811 328.8699 337.6319 355.0507 378.2459 401.8503 416.4063 447.6586 461.6034 477.9323 537.9939 561.8716 575.3549 627.8141 675.7084 739.9897 761.4392 770.6912 797.9432 828.9542 856.1269 863.5961 886.1121 907.8245 920.2529 942.1004 946.4838 964.2321 973.1888 980.7223 1000.6647 1010.8683 1035.2307 1046.7799 1054.3027 1089.1456 1107.3580 1115.2166 1144.3113 1155.9389 1181.7776 1197.2706 1219.0718 1237.3617 1245.7475 1258.3408 1259.6516 1271.5645 1301.5777 1313.5379 1325.9544 1330.3134 1332.0654 1335.7649 1349.4455 1354.0983 1363.9614 1366.7372 1371.1190 1379.2787 1392.3534 1454.2656 1460.6899 1463.8612 1464.3001 1466.3144 1470.0834 1473.2337 1475.3483 1490.9952 1494.7418 1499.3037 1596.1402 2953.3593 2961.3081 2967.4717 2970.3824 2972.5248 2975.0464 2979.8844 2979.9233 2981.8575 3023.2719 3029.2384 3034.1462 3039.7894 3044.8354 3049.4888 3059.2443 3068.4411 3074.1673 3096.5306 3100.7976 3378.4976 3543.6957 3571.1352
redmass: 3.8618 4.0914 3.3628 3.6731 5.4776 3.0831 3.8780 3.6083 3.9514 2.8055 1.2508 2.0074 1.6770 2.9872 1.6309 2.4142 1.7771 1.7909 1.8691 2.6243 2.5009 2.6339 3.0693 2.2117 2.4715 1.1262 1.5225 2.3758 2.5954 3.7294 4.6606 4.6343 1.5092 3.5239 1.7620 2.3071 2.4217 2.1755 1.6402 1.4715 2.3610 1.4403 2.6063 2.1645 4.0324 1.7541 2.8569 2.3003 1.4898 1.7756 1.6959 1.3950 1.0523 2.2746 1.7597 1.8142 2.3379 1.4677 1.4612 1.4753 1.5751 1.5732 1.2910 1.7380 1.5887 1.4480 1.4138 1.4107 1.2220 1.4332 1.4538 1.2039 1.3306 1.1949 1.3229 1.2157 1.0955 1.0887 1.0715 1.0868 1.0671 1.1237 1.2269 1.0600 1.4250 1.0633 1.1121 6.2785 1.0670 1.0374 1.0634 1.0656 1.0640 1.0789 1.0560 1.0496 1.0631 1.0857 1.0943 1.0960 1.1010 1.1011 1.0979 1.0991 1.0984 1.0977 1.0966 1.0998 1.0643 1.0772 1.0662
irintensity: 0.3551 0.3005 1.5147 0.7895 5.0485 1.3237 2.3485 1.9119 4.8435 1.2667 1.0255 0.5965 66.2461 3.0154 16.9870 14.2364 14.5136 55.9438 13.5539 8.3369 2.0781 6.6133 3.3275 5.5426 2.9120 154.0521 81.8023 9.8650 3.1849 2.4398 6.5684 2.9679 0.5155 3.1174 2.8725 1.5861 7.1959 35.0068 12.1425 11.6374 20.3822 9.4658 22.3488 21.5265 76.1926 31.6634 5.4031 27.5825 2.8472 1.9890 0.4689 15.3194 1.9287 12.1314 4.5887 0.1717 25.9004 5.6064 10.8850 34.3978 16.6774 18.5364 15.7773 12.0712 10.8218 6.6035 4.6661 1.9340 17.1050 3.5235 9.4869 11.1645 4.0429 13.1391 174.7738 15.4630 17.3188 4.1139 17.3946 5.9261 5.0210 17.7791 76.3391 3.1142 117.4113 10.8647 45.0109 140.8596 29.7614 23.3528 36.0492 51.6225 29.1881 25.8212 10.4638 47.6913 27.0232 34.8381 65.7903 50.8663 4.4345 101.7081 33.8833 40.4805 34.6259 28.8771 12.5498 13.6942 59.9776 19.6975 7.0168
temp: 298.150 k
press: 1.00000 atm
elementType: 8 8 8 7 6 6 6 6 6 6 6 6 6 6 6 6 1 1 1 1 1 1 1 1 1 1 1 1 1 1 1 1 1 1 1 1 1 1 1
symmnumber: 1
zpe: 892968.4 jmol-1
zpe.correction: 0.340114 hartree
zpe.thermalcorrener: 0.358032 hartree
zpe.thermalcorrenthalpy: 0.358976 hartree
zpe.thermalcorrgfe: 0.293853 hartree
zpe.sumelectzpe: -750.200445 hartree
zpe.sumelectthermal: -750.182527 hartree
zpe.sumelectthermalent: -750.181583 hartree
zpe.sumelectthermalfe: -750.246706 hartree
dipole: 5.1638 -3.9796 0.9381
dipole: 6.5865
quadrupole: -109.4985 -101.3862 -100.8347
quadrupole: 2.1164 -2.0290 0.4096
quadrupole: -5.5920 2.5203 3.0718 2.1164 -2.0290 0.4096
hfenergy: -750.5405591 hartree
pointgroup: C01 [X(C12H23N1O3)]
dipole: -2.000099 -1.6470582 0.0424536 debye
polarizability: 167.2395752|4.5752651|138.7750324|-3.4523887|0.4685159|123.3322614 unknown
InChI: InChI=1S/C12H23NO3/c1-12(2,8-14)10(15)11(16)13-9-6-4-3-5-7-9/h9-10,13-15H,3-8H2,1-2H3
charge 0 multiplicity 1
39 atoms
O  2.09351 1.83259 -1.336165
O  0.28666 1.93315 0.620411
O  4.129223 -0.736774 1.490553
N  -0.763202 -0.034355 -0.035291
C  -1.947772 0.147026 0.845302
C  -2.953889 1.163508 0.239218
C  -2.622861 -1.223285 1.096949
C  -3.661577 0.610187 -1.019243
C  -3.338019 -1.776033 -0.162729
C  -4.346181 -0.747942 -0.731158
C  2.527757 -0.452339 -0.436675
C  1.463509 0.553392 -1.019109
C  0.273418 0.858524 -0.073201
C  3.158683 0.165113 0.846386
C  3.62926 -0.644808 -1.5100
C  1.881816 -1.823307 -0.111641
H  -1.564427 0.562368 1.796043
H  -2.422105 2.105908 0.017426
H  -3.71028 1.393318 1.017234
H  -3.374464 -1.084488 1.898352
H  -1.877192 -1.948347 1.478219
H  -2.920717 0.48515 -1.835418
H  -4.406174 1.34395 -1.381756
H  -3.852103 -2.722741 0.090131
H  -2.597542 -2.033275 -0.951015
H  -5.161079 -0.596264 0.00676
H  -4.817077 -1.144752 -1.650902
H  1.083699 0.127758 -1.970892
H  -0.72824 -0.856917 -0.640128
H  2.36914 0.466424 1.566052
H  3.745605 1.056134 0.574392
H  3.252159 -1.232052 -2.369139
H  4.488332 -1.179883 -1.06794
H  3.972647 0.334999 -1.882583
H  2.669395 -2.569992 0.096796
H  1.306916 -2.208312 -0.977103
H  1.203639 -1.777357 0.761612
H  1.786982 2.466874 -0.623094
H  3.637153 -1.469947 1.937745
