program: Gaussian 09
title: 000289863
version: EM64L-G09RevD.01
frameworkgroup: C1[X(C21H10Cl6O5)]
method: RPBEPBE
basis: SDD
operation: Freq
keyword: #p
keyword: freq=noraman
keyword: PBEPBE/SDD
title: #p freq=noraman PBEPBE/SDD
converged: YES YES NO NO
title: Mulliken charges:
elementType: Cl Cl Cl Cl Cl Cl O O O O O C C C C C C C C C C C C C C C C C C C C C H H H H H H H H H H
charge: 0.086124 0.100278 0.103805 0.137759 0.091785 0.093102 -0.217518 -0.153618 -0.287477 -0.424687 -0.424251 -0.111746 -0.279746 -0.227408 -0.178938 -0.495295 0.046008 -0.002047 -0.053154 0.126912 0.303729 0.294493 0.146820 0.194012 -0.329510 -0.315856 -0.539742 -0.554808 -0.385454 -0.396485 0.313921 0.321907 0.361708 0.365563 0.282091 0.251007 0.254979 0.257073 0.261316 0.261982 0.359963 0.361404
chargesum: 0.00000
title: Mulliken charges with hydrogens summed into heavy atoms:
elementType: Cl Cl Cl Cl Cl Cl O O O O O C C C C C C C C C C C C C C C C C C C C C
charge: 0.086124 0.100278 0.103805 0.137759 0.091785 0.093102 -0.217518 -0.153618 -0.287477 -0.064725 -0.062847 0.249962 0.085816 -0.227408 -0.178938 -0.495295 0.046008 -0.002047 -0.053154 0.126912 0.303729 0.294493 0.146820 0.194012 -0.047419 -0.064849 -0.284763 -0.297735 -0.124138 -0.134503 0.313921 0.321907
polarizability: 3.10534828e+02 5.78539377e+00 3.43054962e+02 -5.23915845e+01 1.06641015e+01 2.27303280e+02
1716.lowfreq: -8.4384 -6.2251 -0.0012 0.0009 0.0010 0.8190 13.8670 35.5653 42.5639
frequency: 13.6080 35.5538 42.5488 47.1780 60.3343 84.4679 97.7399 100.5330 114.5501 127.8107 131.0173 140.4343 147.2727 155.6527 157.8872 161.1612 177.3437 181.2174 198.3674 215.1241 242.2677 263.2879 272.4438 296.9045 302.9524 318.2043 322.3075 338.6350 348.6883 351.0818 355.3199 365.1897 366.7651 378.0267 410.3640 419.0032 445.6789 459.4032 463.3163 469.8412 511.3736 535.0531 557.5579 584.3403 584.8360 589.7855 596.0992 607.2718 612.3485 640.5868 655.1386 676.3434 682.2051 708.9778 722.2458 735.0975 736.7711 746.4337 776.7651 812.6470 819.3662 825.3414 836.4585 838.7461 842.6655 858.6177 881.7970 898.8891 914.4839 945.2992 955.9350 961.8602 971.4202 974.4385 985.8669 992.9264 1022.9332 1042.9205 1068.4479 1081.0201 1091.5036 1096.8881 1110.9082 1131.7291 1133.2959 1148.5469 1159.7056 1170.4730 1190.9507 1207.7807 1215.7314 1237.3694 1254.5930 1259.9280 1275.9775 1300.5756 1306.8129 1337.3084 1393.7737 1401.4702 1428.8559 1442.3914 1485.0130 1499.5973 1586.2125 1591.6156 1604.2057 1624.7678 1644.3879 1701.6656 3072.5378 3083.8963 3148.5699 3149.2426 3151.6306 3165.5819 3183.2278 3186.1583 3584.4010 3585.0277
redmass: 12.9365 9.7733 7.9034 7.7506 12.5628 17.9545 13.5967 19.6308 18.0516 11.6914 7.8030 12.7893 25.3098 18.2649 11.7665 11.9927 15.3170 11.5160 7.6512 13.7799 9.7462 7.5275 16.5740 7.7159 19.8390 11.0838 7.0008 9.7234 26.1709 9.8770 6.3508 1.1766 1.1362 10.8205 6.9954 4.8376 3.3775 7.2818 4.0367 4.3078 6.6408 8.3764 7.3084 7.5718 8.0270 9.3860 6.9960 4.5307 7.3730 5.5863 8.2180 7.7171 6.8542 3.6661 5.3998 6.0075 7.8032 7.4863 6.0904 2.0899 1.8382 2.2927 1.6450 1.7347 7.8759 6.5776 6.3285 7.1754 5.1679 1.4972 6.8807 3.3937 2.1204 1.8535 4.9373 4.9732 6.9379 6.2452 6.2264 4.4026 2.4590 2.0964 4.9873 1.6088 1.5320 7.9535 1.2317 1.5059 2.0509 1.7632 2.1914 1.5083 2.1890 1.6284 2.8784 2.2949 2.0082 1.2780 6.8745 6.1999 3.8364 4.3482 3.2569 3.2481 6.7049 12.0009 7.3710 7.1953 7.6619 13.0126 1.0847 1.0860 1.0922 1.0925 1.0893 1.0885 1.0958 1.0971 1.0662 1.0662
irintensity: 0.1225 0.1003 0.6719 0.0977 0.2633 0.6328 0.4804 0.9619 0.0418 0.0550 0.0731 0.1009 0.0542 0.0348 0.2423 0.1181 0.3808 0.9168 0.1345 0.3744 0.5986 0.2367 1.5211 6.8776 1.0306 2.0799 6.3194 3.6380 0.3937 1.9750 1.8311 17.2861 253.2526 0.5171 2.4655 17.5937 13.2060 12.6390 13.9217 42.0649 17.7325 5.5006 0.5549 2.0303 1.1867 19.7969 20.5918 0.4915 33.2682 4.0219 23.6492 19.1899 17.3345 1.1831 27.1429 10.9236 13.7160 14.4215 21.4001 7.6987 20.8887 24.5561 5.1397 130.1728 25.8858 15.6424 29.7795 6.1138 16.2276 5.2055 70.7554 10.4929 37.7628 29.1120 7.0477 17.9321 49.1870 34.0568 20.9606 65.6066 74.9925 66.9833 224.4837 447.4634 297.9549 14.3317 15.6512 42.8775 1.2992 0.4343 1.0171 47.8271 79.3691 7.5362 15.4225 53.3909 26.6443 16.6310 9.5699 21.2330 25.5944 37.3812 226.0372 16.9832 94.1879 54.1658 19.0748 214.3491 117.0679 270.4751 0.7666 1.2403 3.0591 5.1394 2.1715 2.2014 2.3523 2.0075 56.6830 63.6748
temp: 298.150 k
press: 1.00000 atm
elementType: 17 17 17 17 17 17 8 8 8 8 8 6 6 6 6 6 6 6 6 6 6 6 6 6 6 6 6 6 6 6 6 6 1 1 1 1 1 1 1 1 1 1
symmnumber: 1
zpe: 680167.4 jmol-1
zpe.correction: 0.259062 hartree
zpe.thermalcorrener: 0.287212 hartree
zpe.thermalcorrenthalpy: 0.288157 hartree
zpe.thermalcorrgfe: 0.200007 hartree
zpe.sumelectzpe: -3940.411652 hartree
zpe.sumelectthermal: -3940.383502 hartree
zpe.sumelectthermalent: -3940.382557 hartree
zpe.sumelectthermalfe: -3940.470707 hartree
dipole: -4.9464 0.6768 3.6639
dipole: 6.1926
quadrupole: -203.6304 -219.1633 -236.7087
quadrupole: -0.4554 -14.5655 -1.0338
quadrupole: 16.2037 0.6708 -16.8745 -0.4554 -14.5655 -1.0338
hfenergy: -3940.670714 hartree
pointgroup: C01 [X(C21H10Cl6O5)]
dipole: 1.9342708 -0.4930222 1.3969276 debye
polarizability: 313.3310337|6.6509593|342.6836285|50.2132899|-11.3927125|224.8784081 unknown
InChI: InChI=1S/C21H10Cl6O5/c22-15-16(23)20(25)14-13(19(15,24)21(20,26)27)17(30)32-18(14)9-3-1-7(28)5-11(9)31-12-6-8(29)2-4-10(12)18/h1-6,13-14,28-29H
charge 0 multiplicity 1
42 atoms
Cl -0.991106 -1.143253 2.591399
Cl -4.081079 2.682402 -0.319165
Cl -1.967297 2.35782 2.561024
Cl -4.185015 0.366824 2.397785
Cl -2.655417 -2.714236 0.100992
Cl -4.429819 -0.338412 -1.794572
O  -0.045604 0.403932 -1.919725
O  -1.628016 1.800746 -2.882825
O  2.709235 -0.753491 1.119868
O  1.943423 -5.415598 -0.045563
O  5.149163 3.418889 0.544762
C  -0.531991 0.703006 0.453756
C  -1.397777 1.688326 -0.396622
C  -1.626425 -0.179172 1.167718
C  -2.877328 1.350211 0.019496
C  -2.6658 0.966529 1.533817
C  0.546985 0.138374 -0.566358
C  -2.505725 -0.95255 0.171165
C  -3.239522 -0.039817 -0.524967
C  -1.087943 1.3550 -1.862474
C  0.911799 -1.329924 -0.475071
C  1.811171 0.981797 -0.389362
C  1.950692 -1.716281 0.404217
C  2.796507 0.52512 0.518065
C  0.30088 -2.340434 -1.254462
C  2.008995 2.245833 -0.996269
C  2.315566 -3.060244 0.595658
C  3.916983 1.302694 0.865896
C  0.661339 -3.690427 -1.109172
C  3.125355 3.040711 -0.682431
C  1.649397 -4.050314 -0.16124
C  4.068636 2.572379 0.265254
H  0.006301 1.2261 1.257661
H  -1.185894 2.748836 -0.18826
H  -0.454245 -2.05491 -1.991412
H  1.298131 2.603095 -1.747868
H  3.124425 -3.299677 1.294337
H  4.650607 0.895508 1.57019
H  0.189486 -4.474423 -1.706498
H  3.285608 4.013826 -1.153385
H  2.640614 -5.577913 0.637239
H  5.763005 3.016117 1.207803
