program: Gaussian 09
title: 000289861
version: EM64L-G09RevD.01
frameworkgroup: C1[X(C11H11N3O2)]
method: RPBEPBE
basis: SDD
operation: Freq
keyword: #p
keyword: freq=noraman
keyword: PBEPBE/SDD
title: #p freq=noraman PBEPBE/SDD
converged: YES YES NO NO
title: Mulliken charges:
elementType: O O N N N C C C C C C C C C C C H H H H H H H H H H H
charge: -0.252578 -0.274522 -0.280040 -0.135299 -0.613551 0.341331 0.455215 0.170290 -0.497917 -0.670433 -0.359361 -0.379598 0.174939 -0.211802 -0.210894 -0.247220 0.269047 0.236122 0.265266 0.299211 0.280725 0.265837 0.230934 0.230808 0.231948 0.343810 0.337735
chargesum: 0.00000
title: Mulliken charges with hydrogens summed into heavy atoms:
elementType: O O N N N C C C C C C C C C C C
charge: -0.252578 -0.274522 -0.280040 -0.135299 0.067994 0.341331 0.455215 0.170290 -0.228870 0.130166 -0.078636 -0.113762 0.174939 0.019132 0.019913 -0.015272
polarizability: 2.25706527e+02 -7.80900635e+00 1.53987763e+02 3.52743855e+00 8.18856979e+00 7.83117544e+01
1716.lowfreq: -10.5903 -5.7573 0.0003 0.0005 0.0006 5.6590 40.9046 53.8863 75.6758
frequency: 40.8391 53.8649 75.6553 85.6926 142.0349 158.6074 175.3515 196.5701 251.6639 274.5012 283.0693 318.6847 396.4282 403.5255 409.3727 449.0373 499.3119 507.1034 536.2943 597.5059 598.4599 610.5561 619.1439 655.2634 678.4226 695.9587 706.9684 741.8994 760.9568 797.1947 818.9272 841.1915 914.2062 969.8828 977.6635 986.7114 992.0544 1007.5727 1032.5555 1054.4622 1081.0371 1090.2276 1124.0537 1148.9218 1173.5716 1186.1343 1200.0435 1209.7323 1304.1685 1320.4301 1343.9692 1383.1751 1408.5622 1437.3183 1446.4910 1482.6761 1483.8782 1495.6667 1528.1584 1580.1127 1590.7364 1607.6459 1632.3065 1646.8255 2985.1681 3096.8039 3130.7038 3138.5404 3140.7682 3152.8410 3166.8130 3189.3998 3234.8302 3525.9027 3679.8810
redmass: 4.6687 4.8425 4.8300 5.4726 4.5496 3.5378 1.2374 4.0051 5.4231 4.6448 4.5020 4.0833 6.3730 6.1302 3.0262 4.5830 3.2708 1.3047 1.9664 3.8737 3.0531 4.6708 2.8757 4.8000 3.0587 2.1818 4.8073 4.5657 1.6798 1.9589 4.3637 1.2555 1.4016 1.4733 4.2353 4.9203 1.3967 5.7680 1.9669 1.8714 2.0372 1.7187 1.4374 1.7258 1.0517 1.1205 3.8217 2.8318 4.2919 1.4089 3.6022 8.6846 1.8918 1.8708 2.0526 1.2499 1.8197 1.2083 6.8058 1.9708 6.1436 6.0554 2.3626 10.3134 1.0412 1.0926 1.0852 1.1018 1.0895 1.0946 1.0995 1.0964 1.0983 1.0449 1.1047
irintensity: 5.4132 8.8417 4.1040 0.7771 2.1740 4.6603 0.7896 14.7297 2.4416 4.5242 12.1623 1.0074 0.9773 7.9472 0.9355 0.6922 12.3165 55.3930 148.4791 0.8429 25.6008 13.1706 65.1684 8.7528 0.9567 26.7417 15.6852 64.0418 66.8099 38.5336 9.6761 1.5333 2.9176 3.0370 7.7702 0.4137 0.1667 9.1823 5.6984 2.9479 3.0766 15.1358 8.6706 44.6038 0.1918 0.6161 5.8754 20.4643 310.5328 9.4231 16.4351 7.3477 29.5942 47.7770 61.9461 107.5215 50.8784 2.4986 88.5645 212.9652 6.7457 30.8737 214.7857 307.4319 53.3023 15.4824 1.7144 2.9211 7.2806 24.5552 22.1764 1.6327 0.4129 64.3759 39.6531
temp: 298.150 k
press: 1.00000 atm
elementType: 8 8 7 7 7 6 6 6 6 6 6 6 6 6 6 6 1 1 1 1 1 1 1 1 1 1 1
symmnumber: 1
zpe: 542283.1 jmol-1
zpe.correction: 0.206545 hartree
zpe.thermalcorrener: 0.220735 hartree
zpe.thermalcorrenthalpy: 0.221679 hartree
zpe.thermalcorrgfe: 0.165037 hartree
zpe.sumelectzpe: -739.319363 hartree
zpe.sumelectthermal: -739.305173 hartree
zpe.sumelectthermalent: -739.304229 hartree
zpe.sumelectthermalfe: -739.360871 hartree
dipole: -1.8379 -1.4939 1.8310
dipole: 2.9937
quadrupole: -68.0026 -103.4418 -93.8370
quadrupole: -16.7790 -1.4159 2.1911
quadrupole: 20.4246 -15.0147 -5.4099 -16.7790 -1.4159 2.1911
hfenergy: -739.525908 hartree
pointgroup: C01 [X(C11H11N3O2)]
dipole: -0.7236853 0.5410146 -0.7555217 debye
polarizability: 225.7971793|6.5730786|154.6005666|-5.6245529|2.3365806|77.6082984 unknown
InChI: InChI=1S/C11H11N3O2/c1-13-9(11(12)16)7-10(15)14(13)8-5-3-2-4-6-8/h2-7H,12H2,1H3
charge 0 multiplicity 1
27 atoms
O  0.290815 -2.744756 0.492397
O  -3.510124 1.865297 0.187339
N  0.128648 -0.420643 -0.112663
N  -0.913056 0.548573 -0.169519
N  -4.522125 -0.223653 0.097674
C  -2.100168 -0.123679 0.139934
C  1.50123 -0.030633 -0.045731
C  -0.408164 -1.70855 0.302618
C  -1.835064 -1.451001 0.458986
C  -0.818215 1.623014 -1.186501
C  2.484592 -0.912048 -0.56085
C  1.881964 1.191947 0.567154
C  -3.411872 0.599192 0.13913
C  3.846747 -0.555676 -0.470854
C  3.246609 1.543087 0.630415
C  4.234522 0.673565 0.111693
H  -2.523919 -2.192031 0.857483
H  -0.864909 1.203592 -2.209718
H  0.128146 2.16961 -1.065552
H  -1.661163 2.306932 -1.011448
H  2.177353 -1.863306 -1.00111
H  1.119849 1.835914 1.019132
H  4.606425 -1.240492 -0.86285
H  3.538327 2.48743 1.102937
H  5.293617 0.946384 0.169987
H  -5.442129 0.211658 0.154034
H  -4.449738 -1.232929 -0.015514
