program: Gaussian 09
title: 000289857
version: EM64L-G09RevD.01
frameworkgroup: C1[X(C15H13NO5)]
method: RPBEPBE
basis: SDD
operation: Freq
keyword: #p
keyword: freq=noraman
keyword: PBEPBE/SDD
title: #p freq=noraman PBEPBE/SDD
converged: YES YES NO NO
title: Mulliken charges:
elementType: O O O O O N C C C C C C C C C C C C C C C H H H H H H H H H H H H H
charge: -0.233670 -0.292721 -0.239830 -0.206010 -0.189363 0.022403 0.307042 -0.397367 0.225400 0.366999 0.277833 -0.483705 -0.298878 -0.350664 -0.377417 -0.412896 -0.228400 -0.219047 0.172971 -0.236233 -0.498095 0.233338 0.232933 0.327412 0.264991 0.279212 0.222350 0.315102 0.227545 0.232707 0.230350 0.233270 0.246126 0.246312
chargesum: 0.00000
title: Mulliken charges with hydrogens summed into heavy atoms:
elementType: O O O O O N C C C C C C C C C C C C C C C
charge: -0.233670 -0.292721 -0.239830 -0.206010 -0.189363 0.022403 0.307042 0.068903 0.225400 0.366999 0.277833 -0.156293 -0.033887 -0.071452 -0.155067 -0.097794 -0.000855 0.013660 0.172971 -0.005883 0.227613
polarizability: 3.13236859e+02 -6.64556928e+00 2.06410604e+02 -5.69219125e-02 -1.18241246e-01 7.96799272e+01
1716.lowfreq: -27.0283 -0.0005 0.0004 0.0008 2.1984 6.6558 8.8886 26.4644 40.1542
frequency: -26.9786 26.0699 40.0273 48.8791 54.0606 78.4232 90.3778 105.1641 109.7649 138.9580 172.6181 186.3725 202.1677 214.6804 244.8585 312.8395 317.7089 327.4347 370.9691 403.6849 432.7325 437.8851 467.2504 476.6512 530.0560 557.8654 594.2804 616.5542 642.4334 660.5877 671.1163 705.4270 729.8897 742.2454 743.5576 752.6739 771.0809 815.9698 831.2176 845.7765 860.9945 920.2048 948.1045 966.5243 975.5851 984.9843 988.5489 989.0617 1002.3578 1023.5550 1029.7323 1061.2990 1087.4994 1088.9242 1115.4473 1148.4290 1158.7569 1174.1570 1189.5525 1193.9421 1210.2123 1210.9001 1225.9989 1258.8574 1283.3293 1317.8239 1351.5874 1356.6136 1378.8371 1390.4109 1424.2987 1426.5914 1441.2528 1451.5722 1460.5031 1463.8803 1488.0683 1495.1435 1562.3574 1596.2806 1618.7944 1621.1946 1631.6573 2949.8849 3006.2779 3008.7977 3108.7454 3108.8303 3130.6749 3144.5760 3151.1772 3161.6074 3167.9629 3176.9844 3179.3139 3186.7694
redmass: 10.6520 5.5541 4.4128 5.4377 5.9070 2.5179 1.3957 4.2957 5.6113 4.1027 7.0856 5.1358 6.2921 2.7891 6.2302 5.1246 6.8790 8.3874 10.4269 2.8586 6.5390 3.8488 2.8161 8.4593 3.9033 5.7761 5.7153 6.4925 6.8034 6.7234 9.2353 2.3880 5.9862 2.0498 2.1272 7.0239 7.4230 4.3414 1.5419 7.8082 1.2525 1.3048 7.8960 8.5294 1.4608 1.3633 6.2603 1.3506 1.4434 1.5318 2.1937 2.8225 2.2633 2.4215 1.2634 1.4734 1.4012 1.0520 6.2438 1.1814 1.0643 2.3496 2.1734 5.6377 1.7979 1.4989 1.7050 5.0531 6.1920 4.5167 1.2905 4.0071 2.1354 1.0493 1.1776 1.0517 2.3333 2.5845 8.7122 6.1371 6.1949 6.5020 10.2879 1.0548 1.0295 1.1065 1.1046 1.0883 1.0870 1.0930 1.1049 1.0983 1.0879 1.0972 1.0916 1.0966
irintensity: 0.0993 0.0594 1.2879 0.1777 0.9047 0.1690 0.2024 1.3530 0.7133 2.0345 0.1753 11.9580 2.6742 4.6772 4.8061 20.3114 0.3033 0.8108 0.2446 0.0864 1.8746 0.2210 11.9181 3.6088 4.8377 0.2938 1.4607 0.0445 11.9533 13.4172 31.7351 27.4456 2.1010 94.8701 10.9769 18.6531 5.9041 3.4417 35.7415 0.2937 0.2454 3.0913 33.8547 94.9791 11.6102 0.0074 0.0010 4.9605 0.0026 3.0158 9.9963 89.5046 138.7201 66.0526 0.0214 79.8376 56.4645 0.0141 305.3699 26.7246 1.3146 34.7608 161.0021 468.7731 24.6423 19.4550 20.7515 71.5703 39.6167 12.0281 51.6251 4.1215 18.1550 14.8426 63.2242 12.4662 8.7608 134.7676 30.1681 4.3503 120.0101 124.7659 192.0037 22.0602 40.8930 21.3656 24.2563 11.2698 2.8318 29.2964 15.2101 20.2006 3.2358 20.9704 10.6100 7.6463
temp: 298.150 k
press: 1.00000 atm
elementType: 8 8 8 8 8 7 6 6 6 6 6 6 6 6 6 6 6 6 6 6 6 1 1 1 1 1 1 1 1 1 1 1 1 1
symmnumber: 1
zpe: 661090.7 jmol-1
zpe.correction: 0.251796 hartree
zpe.thermalcorrener: 0.270050 hartree
zpe.thermalcorrenthalpy: 0.270994 hartree
zpe.thermalcorrgfe: 0.203277 hartree
zpe.sumelectzpe: -1008.667953 hartree
zpe.sumelectthermal: -1008.649700 hartree
zpe.sumelectthermalent: -1008.648756 hartree
zpe.sumelectthermalfe: -1008.716472 hartree
dipole: 0.0642 -7.7447 0.0122
dipole: 7.7450
quadrupole: -101.9921 -124.5948 -123.5101
quadrupole: -10.4188 0.0973 -0.0001
quadrupole: 14.7069 -7.8958 -6.8111 -10.4188 0.0973 -0.0001
hfenergy: -1008.9197494 hartree
pointgroup: C01 [X(C15H13N1O5)]
dipole: -0.1141182 2.3741283 1.9066484 debye
polarizability: 313.3214859|-7.1517073|156.6662819|3.2800683|61.6144981|129.3396223 unknown
InChI: InChI=1S/C15H13NO5/c1-20-15(17)12-7-8-14(13(9-12)16(18)19)21-10-11-5-3-2-4-6-11/h2-9H,10H2,1H3
charge 0 multiplicity 1
34 atoms
O  1.128351 0.061375 -0.035079
O  -5.14549 1.207076 0.631722
O  -5.286811 -0.605065 -0.829805
O  -1.135315 -2.64955 -2.317884
O  0.933916 -1.975343 -1.666085
N  -0.35039 -1.869007 -1.646149
C  -0.244831 0.129323 -0.033548
C  1.907967 1.023629 0.770283
C  -0.990925 -0.811179 -0.822154
C  3.381204 0.71132 0.56873
C  -3.102969 0.198922 -0.095059
C  -2.398757 -0.765875 -0.844344
C  -0.973945 1.096401 0.717057
C  -2.375022 1.131781 0.688081
C  4.338747 1.512742 1.240125
C  3.812474 -0.348268 -0.264307
C  5.718013 1.258339 1.0809
C  5.195819 -0.598699 -0.420278
C  -4.590849 0.194505 -0.159163
C  6.150988 0.199587 0.24826
C  -6.626213 1.273424 0.62846
H  1.621159 0.920308 1.83726
H  1.670572 2.05464 0.435671
H  -2.943622 -1.492873 -1.453074
H  -0.437355 1.826332 1.327693
H  -2.921529 1.879357 1.26912
H  4.011946 2.33694 1.888091
H  3.068723 -0.962486 -0.779374
H  6.451216 1.882811 1.603286
H  5.523972 -1.420327 -1.066511
H  7.221177 0.000765 0.123343
H  -6.871128 2.115125 1.29094
H  -7.050221 0.329149 1.008901
H  -6.99727 1.449425 -0.395009
