program: Gaussian 09
title: 000289856
version: EM64L-G09RevD.01
frameworkgroup: C1[X(C19H29NO3)]
method: RPBEPBE
basis: SDD
operation: Freq
keyword: #p
keyword: freq=noraman
keyword: PBEPBE/SDD
title: #p freq=noraman PBEPBE/SDD
converged: YES YES NO NO
title: Mulliken charges:
elementType: O O O N C C C C C C C C C C C C C C C C C C C H H H H H H H H H H H H H H H H H H H H H H H H H H H H H
charge: -0.239216 -0.288633 -0.264563 -0.454146 -0.385303 -0.379872 -0.368143 -0.373330 -0.362131 -0.352945 -0.356779 -0.588380 -0.696496 0.200562 0.488332 -0.448094 -0.339989 0.238170 -0.337002 -0.338603 0.176655 -0.219290 -0.674666 0.196551 0.196415 0.190870 0.190745 0.187557 0.187407 0.190611 0.190547 0.222520 0.221653 0.187404 0.187344 0.195278 0.195265 0.238455 0.237682 0.215635 0.209528 0.209546 0.312843 0.223342 0.309500 0.270008 0.269847 0.228269 0.228111 0.211088 0.229926 0.229918
chargesum: 0.00000
title: Mulliken charges with hydrogens summed into heavy atoms:
elementType: O O O N C C C C C C C C C C C C C C C C C C C
charge: -0.239216 -0.288633 -0.264563 -0.141302 0.007663 0.001743 0.006820 0.007827 0.082042 0.021803 0.033764 -0.112242 -0.061787 0.200562 0.488332 -0.224753 -0.030489 0.238170 -0.066994 -0.068756 0.176655 0.237089 -0.003734
polarizability: 3.81045020e+02 -6.01390299e+00 2.11777316e+02 2.76817115e-01 1.37790271e-01 1.38338694e+02
1716.lowfreq: -33.1396 -10.9257 -0.0016 -0.0001 0.0018 1.6294 3.7670 11.5442 20.8257
frequency: -32.8603 10.7306 20.7220 28.3256 34.7923 42.7539 55.9398 57.8788 64.5633 79.9717 88.8050 96.5104 101.8744 114.5741 129.4682 141.2416 141.4364 149.2239 164.2230 201.3387 229.9579 242.5632 242.7204 258.5296 307.3539 316.2947 333.9833 352.6546 371.9523 407.6272 413.0326 464.9298 477.2745 494.3508 506.9209 564.2146 621.5271 632.6539 658.4149 680.5804 713.8076 719.7122 722.8290 734.7289 759.3984 767.2495 788.2877 797.6456 819.3154 824.1791 841.7415 850.7335 880.4706 882.2220 888.7268 927.0672 950.4140 981.1570 991.0230 1003.8123 1007.6832 1008.1451 1014.0537 1023.8149 1042.3804 1060.6319 1067.0037 1075.8803 1081.1215 1087.9395 1107.4249 1112.1580 1120.5642 1121.7092 1136.6085 1157.2936 1182.1767 1184.0862 1214.0458 1215.5044 1248.8301 1248.8939 1250.4918 1251.0484 1266.8343 1279.2221 1282.2314 1284.4880 1288.6899 1296.1433 1298.5058 1303.8164 1318.7421 1343.4894 1354.8589 1358.0139 1359.5232 1361.3485 1370.0605 1388.4469 1399.5115 1422.0280 1440.4198 1459.5379 1460.5363 1462.8457 1463.3262 1466.2904 1472.2116 1473.6195 1476.7921 1478.6630 1484.6227 1486.6110 1488.1994 1491.2210 1506.2547 1584.0625 1613.0748 1622.0162 1637.9876 2946.6494 2949.3991 2950.2712 2955.2596 2955.6287 2962.2997 2967.9063 2971.1528 2982.2187 2986.8005 2994.6740 2994.9727 2998.8095 3002.7906 3007.6065 3010.2942 3025.8327 3038.7064 3062.7656 3065.3381 3067.7061 3070.2421 3091.3386 3106.3439 3114.4925 3162.4604 3171.3017 3200.9366 3513.6035
redmass: 1.8678 4.4646 4.5979 3.1939 3.3672 1.7128 4.1551 3.8081 3.8421 3.8603 4.1729 2.5355 2.0480 2.5708 5.2753 4.1065 1.9761 2.0955 3.1284 4.3164 1.1167 2.0015 2.3250 4.2267 4.0971 5.0269 4.6135 4.1132 4.6148 3.9619 2.9603 3.5654 3.4920 4.2358 2.8885 2.6112 6.6193 6.9681 1.1819 4.1877 5.6033 1.0597 1.0802 1.1255 4.2026 1.2214 5.8467 1.1028 1.2673 4.6147 1.4099 4.6237 1.4714 1.3182 1.9030 6.6312 1.2485 1.3620 4.4501 3.4407 1.3334 4.0981 1.1374 2.2913 3.2007 3.5616 4.3599 2.6445 2.0676 2.3548 1.3958 2.2109 2.5145 1.3655 1.4694 2.4171 1.1602 1.8050 1.3511 1.4778 1.4884 1.4134 1.6068 1.3275 2.3118 1.0963 1.1180 1.3542 1.0569 1.1264 1.0983 1.4356 1.4159 1.5119 1.6816 1.6613 1.4366 1.7274 3.5901 1.2175 1.2706 4.3537 1.1183 1.0753 1.0750 1.0406 1.0662 1.0796 1.0810 1.0582 1.0426 1.0841 1.0896 1.0823 1.0906 2.0171 2.9882 5.6780 10.4511 5.6563 5.3001 1.0589 1.0588 1.0591 1.0595 1.0589 1.0589 1.0584 1.0367 1.0966 1.0984 1.1009 1.0358 1.0601 1.0991 1.0581 1.1036 1.1047 1.1047 1.1038 1.1065 1.1007 1.0993 1.0985 1.1024 1.0900 1.0946 1.0906 1.0954 1.0761
irintensity: 0.0210 0.0466 0.0125 2.6127 0.2281 0.2184 0.5572 0.6565 7.9127 0.0004 1.1422 2.0230 0.3558 0.1070 0.4596 1.6778 0.0478 0.1218 2.1773 8.6793 0.0029 0.8046 0.8338 1.4317 1.0628 2.2065 17.6244 2.3664 6.2810 6.5036 0.0052 2.0583 0.6617 0.9328 16.3562 2.0461 0.4163 0.7438 49.4745 32.6929 3.0801 18.5653 0.6500 5.6090 14.7325 0.8230 4.6650 2.0151 3.9249 0.6901 29.0399 6.5553 45.1081 7.2895 6.4104 11.3276 1.8317 0.1590 2.3441 22.2427 1.1357 4.4088 0.0036 27.2666 5.3251 173.1295 301.8220 2.0439 0.8630 1.4676 0.1863 3.2997 1.1420 10.2979 5.5739 126.5024 135.6758 0.1492 44.2963 0.3499 140.5584 115.8421 69.9852 2.6879 166.7485 0.0235 0.0126 3.7481 0.6297 0.0684 0.0012 73.4018 12.6524 1.0420 1.6928 3.0105 6.3190 12.0537 171.2304 11.0761 20.7227 26.4768 9.3340 1.2630 0.3422 12.0222 1.8244 0.3872 3.3906 6.8568 12.3745 1.4353 5.6904 7.2966 29.2821 380.7191 306.0253 8.8766 344.7794 88.1127 88.3088 5.6238 0.6118 2.8846 9.8997 12.8998 52.0317 155.4048 36.8676 1.3310 2.3434 2.3872 22.6854 26.5707 8.9436 25.0994 1.1419 0.0656 142.3438 72.7881 9.6478 102.6019 55.2398 34.4613 45.2643 18.0351 4.6973 0.9686 3.7163 12.3195
temp: 298.150 k
press: 1.00000 atm
elementType: 8 8 8 7 6 6 6 6 6 6 6 6 6 6 6 6 6 6 6 6 6 6 6 1 1 1 1 1 1 1 1 1 1 1 1 1 1 1 1 1 1 1 1 1 1 1 1 1 1 1 1 1
symmnumber: 1
zpe: 1166586.1 jmol-1
zpe.correction: 0.444329 hartree
zpe.thermalcorrener: 0.469938 hartree
zpe.thermalcorrenthalpy: 0.470882 hartree
zpe.thermalcorrgfe: 0.383775 hartree
zpe.sumelectzpe: -1020.101183 hartree
zpe.sumelectthermal: -1020.075574 hartree
zpe.sumelectthermalent: -1020.074630 hartree
zpe.sumelectthermalfe: -1020.161737 hartree
dipole: 2.3645 -1.5903 0.0029
dipole: 2.8495
quadrupole: -141.8065 -135.5865 -140.9467
quadrupole: -18.3257 -0.0437 -0.0120
quadrupole: -2.3600 3.8601 -1.5001 -18.3257 -0.0437 -0.0120
hfenergy: -1020.5455119 hartree
pointgroup: C01 [X(C19H29N1O3)]
dipole: -0.9219861 0.6376691 -0.0133339 debye
polarizability: 380.8581892|-8.2356289|211.9196631|-0.1120784|-1.8130613|138.383178 unknown
InChI: InChI=1S/C19H29NO3/c1-3-5-6-7-8-9-10-11-18(21)20-17-14-12-16(13-15-17)19(22)23-4-2/h12-15,20H,3-11H2,1-2H3
charge 0 multiplicity 1
52 atoms
O  -0.091128 -1.109505 0.027969
O  6.933513 -1.089869 0.014088
O  7.355752 1.203148 -0.048116
N  0.84472 1.044472 -0.027362
C  -5.345935 -0.404026 -0.001791
C  -6.716169 0.310116 -0.008355
C  -4.149176 0.573403 -0.011892
C  -7.915621 -0.664213 -0.001128
C  -2.782573 -0.145698 -0.003151
C  -9.285422 0.05126 -0.00634
C  -10.485629 -0.922838 -0.000725
C  -1.602327 0.843537 -0.016901
C  -11.85014 -0.200095 -0.005474
C  -0.233246 0.145593 -0.002842
C  2.237985 0.776227 -0.023058
C  3.118635 1.895809 -0.054598
C  2.777358 -0.540329 0.010808
C  5.053254 0.396582 -0.019483
C  4.508023 1.707154 -0.052864
C  4.173419 -0.715948 0.012278
C  6.53249 0.251202 -0.020169
C  8.407556 -1.325311 0.014578
C  8.611961 -2.836164 0.058909
H  -5.277298 -1.058154 0.892283
H  -5.277927 -1.075652 -0.882848
H  -6.784362 0.980574 0.874176
H  -6.783442 0.966059 -0.901813
H  -4.221767 1.245741 0.869341
H  -4.221035 1.226112 -0.907835
H  -7.849083 -1.321034 0.891536
H  -7.849124 -1.334059 -0.88406
H  -2.7021 -0.795617 0.88851
H  -2.703479 -0.819166 -0.877374
H  -9.354042 0.720167 0.877304
H  -9.353223 0.708812 -0.89854
H  -10.417096 -1.579806 0.890486
H  -10.416602 -1.590567 -0.883862
H  -1.669609 1.520778 0.860608
H  -1.66642 1.492901 -0.915428
H  -12.690234 -0.918865 -0.001472
H  -11.956822 0.43936 -0.902164
H  -11.957391 0.449971 0.88348
H  0.591749 2.036164 -0.05212
H  2.708019 2.913404 -0.080736
H  2.098868 -1.394098 0.03495
H  5.194016 2.559946 -0.077235
H  4.595013 -1.7246 0.038218
H  8.842032 -0.811889 0.891589
H  8.833725 -0.865594 -0.895734
H  9.692928 -3.067292 0.059493
H  8.153578 -3.322155 -0.819324
H  8.164132 -3.268353 0.970092
