program: Gaussian 09
title: 000289855
version: EM64L-G09RevD.01
frameworkgroup: C1[X(C12H12N2O3)]
method: RPBEPBE
basis: SDD
operation: Freq
keyword: #p
keyword: freq=noraman
keyword: PBEPBE/SDD
title: #p freq=noraman PBEPBE/SDD
converged: YES YES NO NO
title: Mulliken charges:
elementType: O O O N N C C C C C C C C C C C C H H H H H H H H H H H H
charge: -0.179988 -0.187073 -0.433503 -0.147733 -0.332549 -0.251540 -0.265269 0.170960 0.171786 -0.369669 -0.334046 0.505244 -0.345856 -0.352012 -0.221307 -0.219985 -0.240603 0.287648 0.288464 0.175203 0.265956 0.247095 0.203559 0.265739 0.269482 0.336446 0.231181 0.230474 0.231898
chargesum: 0.00000
title: Mulliken charges with hydrogens summed into heavy atoms:
elementType: O O O N N C C C C C C C C C C C C
charge: -0.179988 -0.187073 -0.097058 -0.147733 -0.332549 0.036108 0.023195 0.170960 0.171786 0.071490 0.116607 0.505244 -0.080118 -0.082530 0.009874 0.010489 -0.008705
polarizability: 2.09541996e+02 -6.52725103e+00 1.41017283e+02 1.51296444e+01 1.26220904e+01 1.00959078e+02
1716.lowfreq: -4.3253 -0.0008 -0.0004 0.0001 0.9600 8.6455 32.6943 44.3300 60.0610
frequency: 32.6807 44.2673 60.0585 81.9516 91.8527 109.9581 150.3677 183.1657 201.0281 265.5025 276.4173 295.5819 298.5909 336.0363 374.2895 403.6448 435.7638 481.1003 511.9889 538.1558 591.8973 612.9727 648.2569 677.1276 692.5907 703.3314 717.4310 765.1998 775.4186 806.4660 821.9571 837.8694 866.8021 914.6137 958.0645 970.7624 971.2010 989.7718 990.3274 994.9504 1029.6110 1030.8913 1046.9939 1063.0280 1075.8367 1093.2759 1125.2109 1141.4779 1175.8940 1176.6713 1192.0236 1199.7904 1250.6997 1276.2929 1300.8811 1307.9305 1328.4076 1329.8001 1345.6243 1380.5407 1384.9624 1445.1337 1461.4556 1479.9460 1486.9484 1595.8055 1611.3442 1642.2387 1697.9835 2892.1005 2973.1711 3057.6236 3107.2165 3133.5263 3146.5361 3163.1152 3163.2288 3176.6872 3183.4140 3190.9637 3564.9608
redmass: 6.6096 4.1772 6.4027 1.8856 5.2832 5.7835 6.7004 5.5464 4.8154 4.3721 4.8696 7.3786 1.1480 4.3406 5.8122 2.8278 7.2193 4.4381 4.9423 4.9193 10.0314 6.3961 6.0542 6.0774 1.9953 5.8881 6.2006 1.9388 6.0010 2.4916 1.6325 1.2539 1.4108 1.4331 3.8550 1.4451 3.6634 2.2784 6.0692 1.3851 2.0201 2.1626 2.2962 2.3351 3.0467 1.5884 1.3270 2.9224 1.0492 1.6596 1.4578 1.7507 1.5478 1.2705 2.5087 1.4525 1.8328 2.7858 1.2534 1.2829 9.4346 2.3161 1.0728 1.0816 2.3244 6.4307 5.9958 11.7172 12.1456 1.0697 1.0693 1.0898 1.0969 1.0855 1.0906 1.0913 1.0955 1.0975 1.0959 1.0964 1.0665
irintensity: 1.5031 0.7958 0.5740 7.7340 7.0481 2.5606 3.6413 0.3087 0.3818 14.1581 5.9478 6.0346 133.0548 20.2328 3.8384 0.2496 4.0218 14.3618 3.7860 2.1795 16.7963 0.9012 34.3693 0.6847 43.1449 17.2884 6.0005 44.3213 8.1634 7.1499 19.0931 0.0433 15.4383 4.3183 14.3690 4.9353 76.7962 29.0106 0.5598 5.0137 36.4765 2.0170 3.8383 48.1562 12.2607 7.1856 26.2848 121.1308 0.1073 42.1372 7.6803 12.3593 4.9499 12.1901 22.6710 22.5351 78.0232 147.5466 41.5862 0.7398 0.8622 13.9724 4.4724 5.5725 76.3903 6.9957 11.9385 496.8104 16.2188 90.5379 41.5808 10.9053 17.1871 0.0617 17.0705 8.8911 24.0955 3.7067 3.4759 1.3681 12.5546
temp: 298.150 k
press: 1.00000 atm
elementType: 8 8 8 7 7 6 6 6 6 6 6 6 6 6 6 6 6 1 1 1 1 1 1 1 1 1 1 1 1
symmnumber: 1
zpe: 579642.5 jmol-1
zpe.correction: 0.220774 hartree
zpe.thermalcorrener: 0.235944 hartree
zpe.thermalcorrenthalpy: 0.236889 hartree
zpe.thermalcorrgfe: 0.177097 hartree
zpe.sumelectzpe: -798.369174 hartree
zpe.sumelectthermal: -798.354003 hartree
zpe.sumelectthermalent: -798.353059 hartree
zpe.sumelectthermalfe: -798.412851 hartree
dipole: -1.5344 -0.3237 -2.5013
dipole: 2.9523
quadrupole: -84.0191 -109.2348 -98.0397
quadrupole: -1.9506 18.8359 5.2629
quadrupole: 13.0787 -12.1369 -0.9418 -1.9506 18.8359 5.2629
hfenergy: -798.5899477 hartree
pointgroup: C01 [X(C12H12N2O3)]
dipole: -0.6089614 0.2316738 0.9615553 debye
polarizability: 209.8168829|4.4538921|143.1146496|-14.8881503|8.391564|98.5868246 unknown
InChI: InChI=1S/C12H12N2O3/c15-7-6-13-9-10(13)12(17)14(11(9)16)8-4-2-1-3-5-8/h1-5,9-10,15H,6-7H2
charge 0 multiplicity 1
29 atoms
O  0.406392 -2.325878 1.103975
O  -0.021456 2.323339 0.359909
O  -5.793325 0.33703 -1.232581
N  -2.266462 -0.361999 -0.077524
N  0.517046 -0.008029 0.506377
C  -1.58287 -0.857819 1.198634
C  -1.717634 0.6276 0.958614
C  -0.138343 -1.212193 0.944769
C  -0.351005 1.135267 0.570829
C  -3.757807 -0.487828 -0.077462
C  -4.343919 0.520636 -1.087028
C  1.886129 0.037725 0.051842
C  2.393253 -1.023902 -0.737085
C  2.71195 1.136654 0.392116
C  3.730773 -0.981779 -1.181817
C  4.0459 1.170359 -0.0684
C  4.561783 0.114189 -0.852732
H  -2.149513 -1.41887 1.944954
H  -2.397765 1.282165 1.508258
H  -4.214481 -0.33539 0.930829
H  -4.002624 -1.510967 -0.413894
H  -3.928278 0.327654 -2.087562
H  -4.090269 1.561649 -0.796667
H  1.754515 -1.873332 -0.990732
H  2.314686 1.95709 0.99341
H  -6.251712 0.635285 -0.407029
H  4.121326 -1.805371 -1.788974
H  4.681322 2.023902 0.191046
H  5.598989 0.143811 -1.203579
