program: Gaussian 09
title: 000289852
version: EM64L-G09RevD.01
frameworkgroup: C1[X(C26H28N2O4)]
method: RPBEPBE
basis: SDD
operation: Freq
keyword: #p
keyword: freq=noraman
keyword: PBEPBE/SDD
title: #p freq=noraman PBEPBE/SDD
converged: YES YES NO NO
title: Mulliken charges:
elementType: O O O O N N C C C C C C C C C C C C C C C C C C C C C C C C C C H H H H H H H H H H H H H H H H H H H H H H H H H H H H
charge: -0.200467 -0.200411 -0.200626 -0.200332 -0.217101 -0.217519 -0.386103 -0.388247 -0.394202 -0.392498 -0.370060 -0.371887 -0.377999 -0.377158 -0.370363 -0.370463 0.081911 0.082510 0.081522 0.083261 0.179129 0.179494 0.178193 0.180609 -0.354583 -0.354682 -0.354497 -0.354803 -0.211993 -0.212008 -0.211954 -0.212041 0.196390 0.196452 0.197247 0.196249 0.199738 0.200019 0.199863 0.199517 0.198727 0.198614 0.200105 0.197761 0.222236 0.222050 0.220552 0.223711 0.238812 0.238652 0.238516 0.238858 0.269444 0.269477 0.269454 0.269486 0.238362 0.238352 0.238384 0.238337
chargesum: 0.00000
title: Mulliken charges with hydrogens summed into heavy atoms:
elementType: O O O O N N C C C C C C C C C C C C C C C C C C C C C C C C C C
charge: -0.200467 -0.200411 -0.200626 -0.200332 -0.217101 -0.217519 0.006740 0.005249 0.005555 0.006883 0.027281 0.025979 0.066287 0.067105 0.107100 0.106912 0.081911 0.082510 0.081522 0.083261 0.179129 0.179494 0.178193 0.180609 -0.085139 -0.085205 -0.085043 -0.085317 0.026369 0.026344 0.026430 0.026296
polarizability: 4.29162990e+02 -1.07425516e+00 3.04363688e+02 6.83395876e+01 1.08927587e+00 1.95378752e+02
1716.lowfreq: -12.3538 -3.1295 -0.0015 -0.0008 0.0016 2.2796 8.4494 10.6967 12.2927
frequency: 5.8250 8.4756 11.5621 14.6582 22.8795 25.7900 42.1461 48.9529 66.1678 83.8106 85.3136 96.7915 108.1384 122.6509 129.5525 137.9587 137.9712 144.8007 153.0112 170.5885 173.2294 203.9187 205.7581 230.3307 231.1553 262.0885 264.2459 281.4946 309.5565 327.1766 336.5845 376.7126 393.8562 413.2130 420.1941 456.4227 456.4460 462.5491 484.8600 523.2785 523.4390 539.4413 546.7403 605.0516 606.3213 659.1376 659.1455 676.7168 676.8754 699.7812 700.0131 716.5557 716.9189 720.7749 727.2005 736.0032 749.0808 774.4770 785.0797 785.4592 795.6157 795.7249 813.9993 843.4660 864.0834 902.4698 906.1347 906.1861 941.5304 946.1083 956.7563 973.7757 973.8666 990.2935 990.8701 1004.6064 1005.6624 1005.7877 1012.6514 1016.3935 1029.7809 1033.0107 1043.9182 1046.4938 1059.6224 1071.9463 1072.5854 1072.6291 1080.8976 1081.3447 1102.5555 1167.3350 1167.3963 1170.4817 1170.7106 1181.5792 1199.7174 1202.0837 1202.7298 1208.3069 1226.6482 1242.4578 1254.8901 1273.5000 1279.1515 1282.7419 1283.6215 1284.4250 1291.5911 1297.2941 1299.9037 1303.9386 1328.2379 1331.6235 1334.0761 1337.8862 1340.3865 1353.7124 1356.4426 1360.6532 1372.0211 1375.3384 1416.0772 1416.1703 1446.3794 1446.8032 1453.4221 1453.4323 1455.6240 1456.0305 1459.6076 1460.2588 1464.1350 1465.2308 1470.2679 1477.2639 1483.4163 1487.9342 1615.1007 1615.1233 1617.7760 1617.9129 1627.0666 1627.2901 1675.9455 1676.0006 2950.4073 2951.4135 2953.6524 2954.8732 2960.3207 2965.6318 2984.1608 2984.2879 2986.4823 2990.1032 2997.4535 3009.1308 3011.2705 3013.2129 3024.2410 3036.6626 3046.0206 3048.8683 3080.0936 3082.2784 3139.1104 3139.1897 3152.6689 3152.7200 3164.2813 3164.3047 3174.2870 3174.3492
redmass: 5.2954 5.5507 5.4638 6.1704 4.9781 3.9224 2.1806 5.7536 3.0779 2.5837 3.5963 4.6294 2.4067 1.9664 5.5365 4.9774 4.9798 2.1121 1.9893 9.0191 6.4996 5.0186 4.6922 4.2986 4.4187 3.2517 3.1255 6.1476 4.2421 9.4936 9.8543 4.7084 3.2993 3.2407 3.3603 4.8839 4.8857 3.9985 3.1500 7.2049 7.2019 6.8144 5.8585 9.0099 8.2161 4.8002 4.7988 4.9428 4.9885 5.4172 5.4217 3.0760 3.0677 1.0631 1.0774 1.1274 1.2362 1.3955 5.2876 4.9128 1.6856 1.6831 1.7175 2.8991 2.5507 1.6003 1.3908 1.3922 6.9697 7.1848 1.4956 1.4134 1.4133 5.0735 4.7586 1.6957 1.3481 1.3485 2.2965 2.0813 3.3172 2.1744 2.6267 1.7272 3.5230 2.5832 2.6577 2.6545 2.1546 2.2613 5.1989 1.2084 1.2073 2.0455 2.0322 2.1169 1.9364 2.4782 2.9019 1.3579 1.6250 1.2845 1.4120 1.2805 1.2368 1.1248 1.4826 1.3519 1.0538 1.1529 1.0867 1.3137 1.5847 1.3442 1.2375 3.3864 2.8676 1.5236 1.6993 1.6068 1.5738 1.5422 5.9614 5.9230 1.2502 1.2612 2.4655 2.4673 2.0820 2.1061 1.0768 1.0920 1.0725 1.0739 1.0920 1.0989 1.1008 1.1009 7.7054 7.7053 8.4221 8.4204 10.7269 10.7803 11.7191 11.7187 1.0587 1.0586 1.0591 1.0591 1.0592 1.0585 1.0965 1.0589 1.0590 1.0982 1.1005 1.1032 1.0582 1.0582 1.1045 1.1045 1.1041 1.1041 1.1061 1.1061 1.0864 1.0864 1.0906 1.0906 1.0956 1.0956 1.1004 1.1004
irintensity: 0.0750 0.2666 0.4252 0.0599 0.0603 0.3500 0.3003 3.7364 0.0393 0.0768 0.0306 0.0024 0.3229 0.8777 12.1542 0.0018 0.0074 0.0380 0.1114 0.0949 1.0470 0.0613 1.6022 0.1669 0.1258 2.9329 3.0632 8.9616 0.0355 0.0940 22.2911 0.0054 4.5640 0.0810 1.6580 0.0002 0.0005 10.9831 0.0001 8.5805 9.8749 0.0062 4.1175 0.2606 25.0053 0.0138 0.0134 0.2500 0.2809 16.7738 1.8269 3.6082 143.5992 13.8862 0.0830 9.2483 0.0569 0.8027 0.0005 0.0049 20.7184 42.5220 0.0329 14.3980 0.5559 29.0511 0.0326 0.1398 25.5079 0.0733 1.0127 2.2185 2.2228 5.0976 4.0176 65.4846 0.6542 0.7733 0.4773 0.7723 0.0713 1.8004 19.6776 54.9524 7.0508 0.0064 0.5292 17.2857 0.0274 0.0740 0.0021 18.5328 0.2198 0.3711 6.7438 0.6814 19.5744 48.7235 0.0220 11.1940 0.2492 0.1421 4.8178 0.5379 0.3989 0.0090 0.5497 0.0522 1.1031 0.6212 0.0336 0.0241 167.3513 31.8204 6.1902 5.7673 455.0384 0.2275 0.0112 0.1191 50.3517 36.9401 13.7624 8.5886 19.1173 16.9586 8.7081 13.4949 5.7660 3.9333 0.1334 2.0327 0.2929 0.2172 0.0516 5.6510 1.6555 33.9663 2.7358 1.3514 62.3465 231.5422 28.8844 569.6715 70.4319 12.6906 0.2154 1.2666 0.3475 4.5470 5.3228 162.8625 0.0445 24.9947 26.4861 1.1439 0.0394 2.7586 35.7476 37.0523 0.3472 45.9752 25.8631 134.9343 16.3231 16.8767 1.7310 1.7227 5.6686 5.4176 6.1875 6.4883 24.4750 20.3271
temp: 298.150 k
press: 1.00000 atm
elementType: 8 8 8 8 7 7 6 6 6 6 6 6 6 6 6 6 6 6 6 6 6 6 6 6 6 6 6 6 6 6 6 6 1 1 1 1 1 1 1 1 1 1 1 1 1 1 1 1 1 1 1 1 1 1 1 1 1 1 1 1
symmnumber: 1
zpe: 1277203.3 jmol-1
zpe.correction: 0.486461 hartree
zpe.thermalcorrener: 0.516907 hartree
zpe.thermalcorrenthalpy: 0.517852 hartree
zpe.thermalcorrgfe: 0.416353 hartree
zpe.sumelectzpe: -1415.723859 hartree
zpe.sumelectthermal: -1415.693412 hartree
zpe.sumelectthermalent: -1415.692468 hartree
zpe.sumelectthermalfe: -1415.793967 hartree
dipole: -0.0117 0.3341 0.0344
dipole: 0.3360
quadrupole: -96.4062 -208.1133 -187.4134
quadrupole: -1.4397 30.6517 -0.3857
quadrupole: 67.5714 -44.1357 -23.4358 -1.4397 30.6517 -0.3857
hfenergy: -1416.2103197 hartree
pointgroup: C01 [X(C26H28N2O4)]
dipole: 0.0045697 -0.1313649 0.0141138 debye
polarizability: 429.2675829|-1.3970413|304.3521983|-68.1544067|-1.5668838|195.2856491 unknown
InChI: InChI=1S/C26H28N2O4/c29-23-19-13-7-8-14-20(19)24(30)27(23)17-11-5-3-1-2-4-6-12-18-28-25(31)21-15-9-10-16-22(21)26(28)32/h7-10,13-16H,1-6,11-12,17-18H2
charge 0 multiplicity 1
60 atoms
O  7.258819 -2.281712 1.066932
O  7.33433 2.365039 0.303196
O  -7.315823 -2.349946 -0.960368
O  -7.284106 2.326755 -0.403603
N  6.978532 0.069059 0.82016
N  -6.983006 0.003147 -0.822389
C  0.566525 0.094736 0.492579
C  -0.565959 0.009688 -0.554997
C  1.98053 0.014918 -0.125319
C  -1.977577 0.041195 0.072868
C  3.107472 0.142333 0.924148
C  -3.11228 0.026821 -0.975489
C  4.519203 0.03179 0.30788
C  -4.518233 0.001239 -0.336692
C  5.622713 0.182858 1.379758
C  -5.633362 0.062246 -1.405121
C  7.68784 -1.160961 0.694471
C  7.725853 1.171105 0.31116
C  -7.716136 -1.204895 -0.632763
C  -7.699939 1.142071 -0.352803
C  8.99764 -0.80738 0.054844
C  9.020383 0.590163 -0.174893
C  -9.008923 -0.795553 0.007877
C  -8.999065 0.610816 0.176214
C  10.081662 -1.624615 -0.297282
C  10.127829 1.216916 -0.764545
C  -10.104584 -1.573274 0.40983
C  -10.084648 1.286244 0.752691
C  11.2076 -1.00037 -0.895877
C  11.230323 0.398584 -1.125939
C  -11.208571 -0.899537 0.995495
C  -11.198633 0.508264 1.164454
H  0.444507 -0.724019 1.232398
H  0.467475 1.043696 1.06017
H  -0.449513 -0.921614 -1.147776
H  -0.464155 0.850409 -1.272887
H  2.095708 0.815478 -0.885354
H  2.090435 -0.947656 -0.6667
H  -2.09433 -0.827929 0.753277
H  -2.077618 0.947708 0.705489
H  2.97916 -0.645517 1.695572
H  3.007958 1.115487 1.448836
H  -2.991439 -0.857032 -1.636023
H  -3.017308 0.921234 -1.62626
H  4.653865 0.814556 -0.463669
H  4.632804 -0.949123 -0.193185
H  -4.639729 -0.922615 0.261561
H  -4.631809 0.859381 0.353869
H  5.547661 1.172613 1.865526
H  5.516119 -0.604055 2.148354
H  -5.558701 1.004528 -1.977831
H  -5.541398 -0.790112 -2.102569
H  10.053151 -2.703197 -0.113595
H  10.134363 2.297821 -0.936244
H  -10.101163 -2.65917 0.273065
H  -10.066235 2.373505 0.876844
H  12.072986 -1.60627 -1.185107
H  12.11285 0.852324 -1.589506
H  -12.082252 -1.473487 1.322473
H  -12.064705 1.000614 1.619591
