program: Gaussian 09
title: 000027815
version: EM64L-G09RevD.01
frameworkgroup: C1[X(C12H7N3O3S)]
method: RPBEPBE
basis: SDD
operation: Freq
keyword: #p
keyword: freq=noraman
keyword: PBEPBE/SDD
title: #p freq=noraman PBEPBE/SDD
converged: NO YES NO NO
title: Mulliken charges:
elementType: S O O O N N N C C C C C C C C C C C C H H H H H H H
charge: 0.361732 -0.117873 -0.216881 -0.174146 -0.033406 0.011448 0.018606 0.201087 -0.437916 -0.035146 0.389155 -0.077482 -0.401421 -0.227726 -0.224989 -0.225357 -0.208239 -0.207695 -0.219637 0.271186 0.296157 0.266393 0.266026 0.242456 0.242406 0.241263
chargesum: 0.00000
title: Mulliken charges with hydrogens summed into heavy atoms:
elementType: S O O O N N N C C C C C C C C C C C C
charge: 0.361732 -0.117873 -0.216881 -0.174146 -0.033406 0.011448 0.018606 0.201087 -0.437916 -0.035146 0.389155 0.193704 -0.105264 -0.227726 0.041404 0.040668 0.034218 0.034710 0.021627
polarizability: 2.99123166e+02 2.57883679e+00 1.87798610e+02 3.63889791e-01 -2.74011307e-01 1.08306772e+02
1716.lowfreq: -5.6232 -3.9913 -2.6233 0.0012 0.0018 0.0019 21.2890 30.9032 47.4368
frequency: 21.2599 30.8642 47.4262 55.0016 81.0738 142.6923 168.6371 184.7937 203.0965 225.1084 272.2137 308.5611 319.1323 382.1340 402.2364 407.6360 453.7641 483.8895 517.4807 546.8604 565.9899 590.9988 593.8295 608.9821 635.9320 676.6417 689.0524 694.9456 700.3111 738.4226 744.6377 761.1726 839.8943 851.4865 863.8936 907.9008 933.7015 949.4462 981.7759 984.5794 986.5740 993.9048 1005.2135 1014.0708 1072.2758 1074.1253 1119.7414 1175.1072 1176.2043 1185.0306 1221.5823 1282.3048 1290.6996 1303.6260 1329.1055 1366.9629 1374.7766 1427.3748 1458.1335 1459.0179 1469.2860 1524.9730 1585.7526 1588.4074 1591.4141 3137.4849 3146.0854 3156.1407 3164.1474 3165.0173 3175.9023 3179.1760
redmass: 5.2202 5.2154 6.5994 15.2183 8.2053 9.0233 12.8864 11.8280 5.6742 6.3251 5.9975 12.2345 6.1872 12.5181 2.8192 9.9630 13.0350 4.2909 6.0818 6.7805 6.3739 8.9082 8.5747 6.4867 8.8066 6.8327 8.2866 2.6992 5.3753 10.6187 11.0018 1.5356 13.8295 1.2622 1.3046 9.7987 1.3578 10.9995 1.3870 6.4977 1.3701 7.4834 1.3274 3.4577 2.3752 1.6003 1.9080 3.4476 1.0545 1.1459 3.4267 2.2616 8.4849 1.3116 4.7579 13.7549 9.9911 2.0697 7.4422 2.2956 4.1556 6.7788 5.9644 6.3112 8.9465 1.0856 1.0886 1.0930 1.0885 1.0973 1.1018 1.0947
irintensity: 0.6002 0.0544 0.3321 0.0059 2.9637 0.8198 0.4867 1.8151 0.9322 0.0778 0.1552 0.9271 2.0188 0.0098 0.0426 4.4467 0.9319 14.7983 0.2068 20.3503 0.0025 1.0110 0.4670 0.1263 0.6176 3.7946 12.6287 13.4191 51.0716 1.8334 0.0004 70.5032 14.7025 6.3347 19.0304 70.1353 2.6257 7.7324 0.4864 19.3017 2.8866 26.8141 0.0428 11.4635 2.1356 7.8850 0.9568 249.7917 0.0016 0.8785 353.9933 9.4021 12.6313 1.0012 2.8731 106.9489 2.2710 12.1422 88.7139 13.8530 20.6628 272.2267 4.3942 1.7349 3.9181 0.1616 2.9433 10.1142 0.9706 13.4085 16.4779 1.8451
temp: 298.150 k
press: 1.00000 atm
elementType: 16 8 8 8 7 7 7 6 6 6 6 6 6 6 6 6 6 6 6 1 1 1 1 1 1 1
symmnumber: 1
zpe: 447206.4 jmol-1
zpe.correction: 0.170332 hartree
zpe.thermalcorrener: 0.185772 hartree
zpe.thermalcorrenthalpy: 0.186716 hartree
zpe.thermalcorrgfe: 0.124841 hartree
zpe.sumelectzpe: -1247.971401 hartree
zpe.sumelectthermal: -1247.955961 hartree
zpe.sumelectthermalent: -1247.955016 hartree
zpe.sumelectthermalfe: -1248.016891 hartree
dipole: -9.8620 -1.9256 -0.0086
dipole: 10.0482
quadrupole: -130.1411 -129.8739 -107.1575
quadrupole: 13.0230 0.1400 -0.1799
quadrupole: -7.7502 -7.4831 15.2333 13.0230 0.1400 -0.1799
hfenergy: -1248.1417325 hartree
pointgroup: C01 [X(C12H7N3O3S1)]
dipole: -3.8220987 -0.8659532 0.5196659 debye
dipolederiv: -0.5928253 0.2075505 0.0271421 0.5423792 0.0445453 -0.0620703 -0.0252046 -0.0297769 0.0017558 0.0111242 -0.290597 0.0348818 -0.372202 -0.2344951 0.0601775 0.0489646 0.0535411 -0.1013829 -0.495187 0.0964423 0.0110556 0.4052158 -0.984398 0.0758626 -0.0374047 0.1081006 -0.2473152 -0.9600711 0.0251358 0.0726539 -0.0559628 -0.4286119 0.0411829 0.0844196 0.0328034 -0.2159196 -0.0939979 0.3387368 -0.053195 0.1672682 0.0365048 -0.0371337 -0.0261424 -0.0558417 -0.0836689 -0.0033851 -0.147966 0.0157583 0.3257865 0.0404877 -0.0523015 -0.0596073 -0.0047893 -0.075553 1.9201029 -0.4995074 -0.0966716 -0.7542679 1.3857812 -0.1110827 -0.0558427 -0.1375902 0.2134585 -0.3021876 0.2176076 0.0099552 -0.1307205 -0.0941937 0.0474367 0.0631739 0.0119745 0.1168925 1.127826 -0.355237 -0.0668887 -0.9717468 0.4185139 0.0253473 0.0318858 -0.036083 -0.0550386 -0.2956633 -0.0581377 0.048526 -0.0534878 0.2526439 -0.0189236 0.0481026 -0.0182906 0.0941408 -1.1523495 0.5362256 0.0375355 0.1651124 -0.1217196 0.0095829 0.0944511 -0.0276995 0.0407777 -0.4846343 0.3195056 -0.0093264 0.9222514 -0.5381318 -0.0251317 -0.1035044 0.0360451 -0.0917123 0.9542126 -0.4991125 -0.0250246 -0.0744267 0.0606043 -0.0107814 -0.0905636 0.0319945 -0.0527187 0.4598539 0.1788191 -0.0690023 0.3792634 -0.0912547 -0.0196523 -0.1006215 0.0018966 0.0506868 -0.2378145 0.0274249 0.115601 -0.1306643 -0.0654222 0.1090211 -0.0952954 -0.0096048 -0.0064526 -0.2276239 0.0040042 -0.0701843 -0.109455 -0.0836384 -0.0622305 0.1827435 0.028636 0.0055411 -0.1167182 0.0310316 -0.0868414 0.0349547 -0.0938103 -0.0693682 -0.0180836 -0.02965 0.1029723 -0.0887061 0.0709357 0.1111817 0.0638879 -0.0553352 0.1003421 0.0435395 0.0603153 0.0342793 0.010812 0.1518992 -0.0263292 0.1186965 -0.0033784 -0.0170659 -0.0217602 -0.0201833 -0.0219808 0.056675 -0.0286318 0.0105784 -0.0883281 0.0541377 0.0188142 0.0187505 0.0130172 0.1131053 0.1196389 0.0110335 0.0020854 -0.0097434 0.0659587 0.0149101 0.0054156 0.0130806 0.1531664 0.1230789 -0.0631581 -0.0692838 -0.0447272 0.0791311 -0.0510901 -0.0894173 -0.0287442 0.0364655 0.1556295 -0.039673 0.0551986 -0.0116472 0.0998141 0.0350653 0.0683333 0.0167459 -0.0146796 0.0694533 -0.044968 0.0484532 -0.0715425 0.1171523 0.0335872 0.0726838 0.0303399 -0.0698 0.0414895 -0.0708201 -0.0549628 -0.102947 0.0901603 -0.0568164 -0.0699348 -0.060007 -0.0149607 0.0012673 -0.1185439 0.0271034 -0.142947 0.0489537 0.0223182 0.0309184 0.0197698 0.087941 unknown
polarizability: 296.8458929|4.6807265|186.0443134|-19.3936716|-13.060204|112.338342 unknown
InChI: InChI=1S/C12H7N3O3S/c16-15(17)9-6-7-10(12-11(9)13-18-14-12)19-8-4-2-1-3-5-8/h1-7H
charge 0 multiplicity 1
26 atoms
S  -1.599504 1.723768 -0.192145
O  2.774898 2.810282 -0.810283
O  3.54366 -2.832401 -0.003838
O  4.761414 -0.939207 -0.422132
N  1.357067 2.69972 -0.647167
N  3.454751 1.527705 -0.677309
N  3.647662 -1.557524 -0.214523
C  1.156882 1.37533 -0.420771
C  -0.099498 0.706624 -0.188919
C  2.43052 0.657579 -0.438145
C  2.415214 -0.761119 -0.215184
C  -0.04854 -0.676758 0.020656
C  1.188646 -1.391065 0.006667
C  -2.905951 0.454084 0.137106
C  -3.28726 0.180109 1.470044
C  -3.557292 -0.167366 -0.952425
C  -4.333047 -0.740708 1.713333
C  -4.602227 -1.086524 -0.69909
C  -4.988819 -1.373513 0.631143
H  -0.973185 -1.231331 0.201069
H  1.198149 -2.4723 0.174798
H  -2.779377 0.680626 2.300616
H  -3.256375 0.066564 -1.978562
H  -4.63487 -0.956814 2.743477
H  -5.112415 -1.570436 -1.538456
H  -5.801003 -2.082726 0.823638
