program: Gaussian 09
title: 000289843
version: EM64L-G09RevD.01
frameworkgroup: C1[X(C18H14Cl2N2O4)]
method: RPBEPBE
basis: SDD
operation: Freq
keyword: #p
keyword: freq=noraman
keyword: PBEPBE/SDD
title: #p freq=noraman PBEPBE/SDD
converged: YES YES NO NO
title: Mulliken charges:
elementType: Cl Cl O O O O N N C C C C C C C C C C C C C C C C C C H H H H H H H H H H H H H H
charge: -0.065011 -0.064974 -0.292256 -0.292179 -0.265719 -0.265584 -0.447944 -0.447935 0.590599 0.590534 -0.352809 -0.352828 -0.329913 -0.329885 -0.216309 -0.216343 -0.218868 -0.218884 -0.241882 -0.241928 0.272997 0.273218 -0.378544 -0.378782 0.048202 0.047759 0.305340 0.305393 0.256041 0.256017 0.233666 0.233641 0.341845 0.341836 0.236757 0.236767 0.254893 0.269210 0.254829 0.269033
chargesum: 0.00000
title: Mulliken charges with hydrogens summed into heavy atoms:
elementType: Cl Cl O O O O N N C C C C C C C C C C C C C C C C C C
charge: -0.065011 -0.064974 -0.292256 -0.292179 -0.265719 -0.265584 -0.106099 -0.106100 0.590599 0.590534 -0.352809 -0.352828 -0.024573 -0.024492 0.039732 0.039674 0.014798 0.014757 -0.005125 -0.005161 0.272997 0.273218 0.145560 0.145079 0.048202 0.047759
polarizability: 3.58155297e+02 -3.04146152e-01 2.46409558e+02 5.38702291e+01 3.17202880e-01 1.53430426e+02
1716.lowfreq: -0.0018 -0.0014 -0.0002 1.9511 2.1730 7.3155 7.8082 10.6053 12.0849
frequency: 7.8042 10.5730 12.0450 18.3612 24.5586 54.6751 63.7953 78.1128 82.8230 101.7109 113.0539 137.6543 141.6153 164.5812 167.0764 208.8805 210.7715 252.2084 267.5523 278.9969 280.2322 294.4194 299.6012 332.2597 342.9662 376.8123 383.0441 418.1641 419.7724 439.8431 439.9520 480.6715 538.6136 538.6543 547.4679 605.3981 613.5677 662.3363 662.5418 676.1770 677.7115 679.6439 680.5107 709.6151 709.6545 732.3931 732.6502 760.7755 760.9219 775.4468 824.7814 829.9182 870.3398 870.3798 883.6811 888.4519 948.1797 948.2133 965.5828 976.4118 991.2404 991.2627 1000.6076 1003.9044 1013.0939 1016.1141 1043.1252 1043.6047 1126.8974 1128.4823 1157.9107 1169.1117 1173.6290 1173.7896 1180.0274 1241.8478 1245.1058 1245.1555 1250.7656 1309.4805 1309.6838 1341.5702 1345.9782 1375.8411 1375.9656 1431.3341 1431.9307 1433.3322 1435.6942 1457.1111 1457.2846 1518.5070 1522.0831 1579.7187 1579.7724 1616.0981 1616.9692 1670.7081 1670.8003 2283.1996 3015.9568 3016.5031 3090.0556 3090.7008 3143.2394 3143.3657 3159.6496 3159.6814 3176.6951 3176.8093 3187.1520 3187.2627 3496.6958 3496.9073
redmass: 8.5755 6.5987 10.2295 7.1623 8.3277 9.0548 10.0192 6.6151 5.9510 7.9608 5.8428 6.1663 6.0172 5.9982 5.9999 5.6578 6.7585 8.2720 5.0033 5.4770 4.9634 7.4208 2.9700 9.5353 3.6671 7.8278 6.9659 8.0350 8.4110 3.3888 3.3897 6.7499 3.6064 3.5984 9.1409 5.9992 6.4173 6.0502 6.1923 2.7764 2.9017 6.7964 5.8435 3.3422 3.3372 1.9016 1.8813 1.2633 1.2632 4.8797 5.9327 5.4946 1.3466 1.3465 7.6197 7.2905 1.3565 1.3565 4.8861 3.7685 1.3133 1.3133 2.5337 3.3498 5.8705 5.1407 2.0048 2.0162 1.6667 1.6017 3.4458 3.0024 1.0752 1.1001 3.7247 1.0903 1.6141 1.6110 1.0877 1.7305 1.7156 1.3412 1.2224 6.4982 6.9404 2.4728 2.5507 1.1178 1.1015 2.2541 2.2607 2.5014 2.5382 5.1681 5.1533 6.6341 6.5354 8.3500 8.4392 11.7534 1.0594 1.0596 1.1024 1.1023 1.0866 1.0865 1.0916 1.0917 1.0973 1.0973 1.0967 1.0967 1.0760 1.0760
irintensity: 0.0056 0.0303 0.0093 0.0126 0.1826 0.1625 7.7520 0.5464 1.9617 1.6070 3.4529 1.5272 0.4509 0.6143 0.5006 0.4796 6.7512 1.0628 16.2733 12.7024 0.4523 19.0329 1.4248 1.2308 67.1613 3.0986 3.7110 2.3129 0.9645 9.3241 12.8621 10.4870 7.8059 0.9405 14.2943 0.0400 2.7213 16.5066 18.2223 2.0938 17.1900 14.2625 0.3998 24.5251 22.6209 67.1844 5.1443 15.9577 253.3524 8.7842 64.4246 8.9710 3.1090 4.9082 5.9235 12.3650 3.8226 6.9292 550.3773 55.4714 1.5101 2.6052 134.5796 62.9232 286.3418 1.7623 11.8679 0.0245 96.4645 2.8046 873.1511 6.4484 2.6751 0.2022 35.9482 21.0991 18.3862 5.5819 0.0510 56.6877 1.5587 64.9108 3.0415 114.4184 69.4160 85.7493 110.1755 24.7696 44.1221 4.1951 30.0561 1108.9612 112.0835 33.7676 5.9726 220.5769 65.2576 67.2697 381.7741 0.3473 13.4618 31.8347 0.5974 4.1660 3.8976 3.9691 11.1233 10.9705 6.7693 6.0894 12.4204 9.9888 12.6162 117.8580
temp: 298.150 k
press: 1.00000 atm
elementType: 17 17 8 8 8 8 7 7 6 6 6 6 6 6 6 6 6 6 6 6 6 6 6 6 6 6 1 1 1 1 1 1 1 1 1 1 1 1 1 1
symmnumber: 1
zpe: 750501.3 jmol-1
zpe.correction: 0.285851 hartree
zpe.thermalcorrener: 0.310436 hartree
zpe.thermalcorrenthalpy: 0.311380 hartree
zpe.thermalcorrgfe: 0.224109 hartree
zpe.sumelectzpe: -2022.957670 hartree
zpe.sumelectthermal: -2022.933085 hartree
zpe.sumelectthermalent: -2022.932141 hartree
zpe.sumelectthermalfe: -2023.019412 hartree
dipole: 0.0051 0.4991 -0.0079
dipole: 0.4992
quadrupole: -128.2673 -166.6489 -158.7991
quadrupole: 0.0134 12.5006 0.0051
quadrupole: 22.9712 -15.4105 -7.5606 0.0134 12.5006 0.0051
hfenergy: -2023.2435208 hartree
pointgroup: C01[X(C18H14Cl2N2O4)]
dipole: 0.0033253 -0.1956968 0.0162714 debye
polarizability: 357.6820218|-2.6372976|245.9940306|-54.6907112|-6.2528901|154.3192273 unknown
InChI: InChI=1S/C18H14Cl2N2O4/c19-13-7-1-3-9-15(13)21-17(23)25-11-5-6-12-26-18(24)22-16-10-4-2-8-14(16)20/h1-4,7-10,21-22H,11-12H2
charge 0 multiplicity 1
40 atoms
Cl 5.400762 -3.032828 0.973546
Cl -5.376777 -3.203124 -0.561224
O  2.389822 0.607054 1.386553
O  -2.406231 0.380473 -1.466081
O  3.840009 2.053351 0.209049
O  -3.863797 1.953309 -0.474551
N  4.347931 -0.225356 0.645175
N  -4.348103 -0.368265 -0.602681
C  5.634601 -0.374479 0.078249
C  -5.628411 -0.454964 -0.008973
C  6.273782 -1.642417 0.148431
C  -6.255951 -1.726818 0.089182
C  6.334195 0.682162 -0.567334
C  -6.332448 0.669405 0.503628
C  7.54844 -1.875756 -0.389132
C  -7.523606 -1.900619 0.664626
C  7.615565 0.456393 -1.110181
C  -7.606909 0.503733 1.083215
C  8.229901 -0.813651 -1.026972
C  -8.209743 -0.771659 1.168685
C  3.575836 0.921609 0.682158
C  -3.590086 0.772121 -0.797472
C  1.374534 1.700569 1.429706
C  -1.404153 1.469694 -1.660369
C  0.406366 1.599935 0.33525
C  -0.435395 1.532724 -0.563596
H  5.856184 1.66192 -0.631588
H  -5.863512 1.653429 0.43753
H  7.998718 -2.869321 -0.309929
H  -7.965019 -2.899953 0.716941
H  8.136009 1.284182 -1.60308
H  -8.131099 1.383317 1.471274
H  3.935553 -1.056052 1.08232
H  -3.929806 -1.244462 -0.932122
H  9.224732 -0.984281 -1.449759
H  -9.199134 -0.895199 1.619653
H  0.883608 1.573673 2.408299
H  1.90188 2.671903 1.392658
H  -0.911429 1.214606 -2.612656
H  -1.943125 2.430444 -1.757025
