program: Gaussian 09
title: 000289826
version: EM64L-G09RevD.01
frameworkgroup: C1[X(C14H14O)]
method: RPBEPBE
basis: SDD
operation: Freq
keyword: #pfreq=noraman
keyword: PBEPBE/SDD
title: #p freq=noraman PBEPBE/SDD
converged: NO YES NO NO
title: Mulliken charges:
elementType: O C C C C C C C C C C C C C C H H H H H H H H H H H H H H
charge: -0.215009 0.234912 0.233109 0.285538 0.344688 -0.625084 -0.581596 0.556205 0.366456 -0.575901 -0.569622 -0.814076 -0.825195 -0.821687 -0.247353 0.244978 0.280872 0.207067 0.209787 0.239568 0.239631 0.242330 0.245480 0.235098 0.245442 0.236988 0.236962 0.225421 0.164991
chargesum: 0.00000
title: Mulliken charges with hydrogens summed into heavy atoms:
elementType: O C C C C C C C C C C C C C C
charge: -0.215009 0.234912 0.233109 0.285538 0.344688 -0.380106 -0.300723 0.556205 0.366456 -0.368834 -0.359834 -0.092548 -0.099174 -0.122317 -0.082362
polarizability: 2.87611502e+02 2.55983458e-01 1.81886397e+02 9.21042901e-03 -7.93730534e-03 7.41132251e+01
1716.lowfreq: -100.7242 -7.8831 -0.0006 0.0005 0.0007 7.4104 11.9278 45.0950 53.5337
frequency: -100.7222 45.0803 53.4481 98.8354 125.8234 138.8149 142.6634 181.4410 205.5342 229.3557 281.4059 290.7675 318.7148 336.4954 352.7751 434.8372 452.7638 514.4158 537.6738 540.0294 570.7165 616.8784 620.7939 657.0500 706.4186 740.8685 767.8430 828.9025 856.9271 871.5276 904.4140 922.4725 937.5567 983.4931 984.4910 997.8704 1017.5767 1038.1221 1041.9593 1043.4519 1047.3963 1085.2021 1176.2201 1181.7746 1205.4570 1237.6728 1313.7973 1326.0774 1348.6413 1373.1506 1387.2926 1393.4841 1394.3383 1398.2395 1418.1217 1465.0223 1466.3679 1467.3254 1470.7603 1473.0610 1475.7637 1507.1022 1512.5938 1554.6323 1581.1110 1593.8310 1611.2717 2865.9480 2978.8192 2985.2901 2987.4739 3056.3823 3057.8395 3064.7900 3086.3681 3093.0571 3097.9584 3101.1215 3136.4409 3194.4154 3213.7123
redmass: 1.0261 1.2430 2.5429 4.8054 6.6111 2.3699 1.4039 2.2824 2.7340 2.9671 4.2304 2.9750 3.1300 4.2841 3.7236 5.0648 5.1146 3.2108 3.2685 5.0052 3.2529 4.4804 2.4760 2.6292 4.5909 2.1154 3.8347 2.0238 1.4340 1.3348 1.3163 2.9016 2.7621 1.8837 4.2720 3.1588 1.8461 1.5683 1.6117 1.4992 1.6248 1.7228 1.5574 1.5760 3.5095 2.8382 2.8292 5.0696 2.5837 3.1039 1.5037 1.2134 1.2204 1.4277 1.5105 1.0469 1.0461 1.2485 1.0458 1.2264 1.1263 3.7843 3.4876 4.2148 5.9720 4.8594 6.9226 1.0844 1.0377 1.0372 1.0412 1.0971 1.0969 1.0968 1.0906 1.0923 1.0956 1.0948 1.0945 1.0947 1.0962
irintensity: 1.1464 0.4023 1.6783 0.8543 5.4825 1.9328 8.5368 3.0262 1.0786 4.7954 2.6828 1.2900 2.0002 2.4603 0.5874 0.4369 0.3307 0.0338 0.1490 4.7453 2.7426 3.4876 11.4808 0.4684 21.6065 0.6655 25.6723 21.6382 5.3826 42.3074 0.0972 4.2808 2.5619 7.8554 14.0835 8.2782 1.1708 3.3583 0.0100 8.4465 26.0070 32.4206 37.0355 36.1714 10.0713 25.4621 17.3759 37.3984 3.6419 37.3492 27.4492 56.8141 17.3315 8.8253 1.7475 31.0875 2.4973 44.2747 10.0287 10.6056 20.1140 6.1377 51.6315 75.4680 202.2705 346.1504 15.4609 167.8145 23.3361 16.4498 15.2621 14.1489 14.0192 11.5590 5.0782 2.7100 38.5934 42.4019 12.1576 6.5019 0.9147
temp: 298.150 k
press: 1.00000 atm
elementType: 8 6 6 6 6 6 6 6 6 6 6 6 6 6 6 1 1 1 1 1 1 1 1 1 1 1 1 1 1
symmnumber: 1
zpe: 614734.2 jmol-1
zpe.correction: 0.234140 hartree
zpe.thermalcorrener: 0.247948 hartree
zpe.thermalcorrenthalpy: 0.248892 hartree
zpe.thermalcorrgfe: 0.193384 hartree
zpe.sumelectzpe: -616.018885 hartree
zpe.sumelectthermal: -616.005077 hartree
zpe.sumelectthermalent: -616.004133 hartree
zpe.sumelectthermalfe: -616.059640 hartree
dipole: 6.5986 1.4835 -0.0051
dipole: 6.7633
quadrupole: -102.1022 -74.4996 -92.3394
quadrupole: -7.4862 0.0379 0.0123
quadrupole: -12.4551 15.1475 -2.6923 -7.4862 0.0379 0.0123
hfenergy: -616.2530246 hartree
pointgroup: C01 [X(C14H14O1)]
dipole: -2.5891841 0.6135464 0.0009329 debye
polarizability: 287.5914882|-1.4754524|181.9063717|0.0922106|-0.0059735|74.1132642 unknown
InChI: InChI=1S/C14H14O/c1-9-4-10(2)13-6-12(8-15)7-14(13)11(3)5-9/h4-8H,1-3H3
charge 0 multiplicity 1
29 atoms
O  4.70112 -0.59938 -0.002277
C  0.187955 0.845139 0.00084
C  0.301369 -0.662038 0.001195
C  -0.987832 1.637378 -0.000204
C  -0.742186 -1.64033 0.000571
C  1.526555 1.3470 0.001638
C  1.681514 -0.973374 0.002281
C  -2.850794 -0.155037 -0.001518
C  2.429834 0.247365 0.002728
C  -2.329434 1.15694 -0.001273
C  -2.127964 -1.384657 -0.000645
C  -0.874419 3.158939 -0.000498
C  -0.318829 -3.103863 0.001205
C  -4.370825 -0.296843 -0.002746
C  3.891077 0.372982 0.004158
H  1.83026 2.394216 0.001616
H  2.133715 -1.964385 0.002873
H  -3.089785 1.95157 -0.002042
H  -2.764584 -2.281095 -0.000988
H  -1.383746 3.579851 0.886697
H  -1.379195 3.579137 -0.890651
H  0.162004 3.520568 0.002002
H  0.297985 -3.336625 -0.886301
H  -1.190078 -3.778074 0.000857
H  0.296941 -3.336181 0.889546
H  -4.71432 -0.858927 0.88618
H  -4.712753 -0.860602 -0.891204
H  -4.878814 0.681143 -0.004101
H  4.27203 1.426284 -0.00274
