program: Gaussian 09
title: 000289824
version: EM64L-G09RevD.01
frameworkgroup: C1[X(C18H16N2O6S)]
method: RPBEPBE
basis: SDD
operation: Freq
keyword: #p
keyword: freq=noraman
keyword: PBEPBE/SDD
title: #p freq=noraman PBEPBE/SDD
converged: YES YES NO NO
title: Mulliken charges:
elementType: S O O O O O O N N C C C C C C C C C C C C C C C C C C H H H H H H H H H H H H H H H H
charge: 0.865698 -0.228577 -0.228576 -0.536750 -0.536749 -0.233418 -0.233389 -0.300853 -0.300844 -0.384714 -0.384741 -0.087086 -0.087089 0.444743 0.444768 -0.326340 -0.326348 -0.233862 -0.233807 -0.257945 -0.257969 -0.324245 -0.324256 -0.346849 -0.346846 0.277370 0.277327 0.253322 0.252140 0.253328 0.252142 0.241722 0.242002 0.241719 0.241997 0.274749 0.274748 0.283377 0.283379 0.308282 0.308250 0.250088 0.250098
chargesum: 0.00000
title: Mulliken charges with hydrogens summed into heavy atoms:
elementType: S O O O O O O N N C C C C C C C C C C C C C C C C C C
charge: 0.865698 -0.228577 -0.228576 -0.536750 -0.536749 -0.233418 -0.233389 -0.300853 -0.300844 0.120748 0.120729 -0.087086 -0.087089 0.444743 0.444768 0.157385 0.157368 0.040888 0.040942 0.025431 0.025410 -0.015963 -0.016006 -0.096760 -0.096748 0.277370 0.277327
polarizability: 3.57082700e+02 4.57600235e-04 2.04529494e+02 1.39602953e+01 2.63562367e-03 2.36472323e+02
1716.lowfreq: -5.7541 -2.1690 -1.2367 -0.0020 -0.0014 0.0006 12.6136 15.7661 20.8694
frequency: 12.6133 15.7360 20.8318 45.7667 51.4314 59.4683 74.4471 89.1695 106.3402 124.5135 133.9609 147.9060 154.8418 179.9029 180.7013 191.2129 193.7927 208.2425 229.3046 282.7379 311.9456 328.4471 336.2471 364.6277 379.9302 395.4443 412.6973 413.9149 414.1138 446.3239 496.0291 532.0089 535.0585 548.4028 552.8440 619.2539 621.1137 663.4554 666.0794 676.2958 678.2672 680.6812 681.0244 724.0789 725.8896 734.8487 738.9268 784.6383 825.7459 827.0476 856.8849 858.6116 871.7399 872.0992 905.4940 907.2378 923.3525 956.0776 956.2399 961.9416 963.7612 986.6570 987.1059 988.7606 989.5853 1009.9014 1009.9279 1058.2189 1064.5642 1070.2859 1071.5935 1106.5439 1106.5518 1122.3817 1127.6642 1165.4812 1166.1761 1191.5704 1191.6432 1193.9029 1198.7114 1224.3619 1224.4252 1302.6545 1305.6787 1314.7409 1316.7685 1341.9285 1342.0825 1366.0974 1367.0496 1388.8800 1391.1405 1412.8445 1414.5252 1482.9177 1485.3976 1487.0523 1488.3321 1498.7285 1498.8398 1587.4926 1591.7706 1599.9669 1600.7399 1698.6228 1698.7444 2988.5285 2988.5314 3034.4203 3034.4674 3059.6598 3059.6821 3120.2198 3120.2310 3150.8056 3150.8373 3155.7471 3155.7869 3171.7394 3171.9764 3193.2418 3193.3359
redmass: 8.3760 4.9323 5.3034 5.4466 3.8564 4.4395 6.1713 10.2309 7.3838 2.7860 2.2595 4.1185 6.1890 9.0875 8.7629 6.3196 7.8287 5.2402 5.8233 7.9239 7.1978 9.0099 9.2301 6.1011 6.6784 6.0979 2.9715 6.0370 3.0605 8.0248 6.2388 3.2690 3.3495 5.3073 7.5631 7.1418 7.2015 9.2921 9.2270 4.7420 4.4981 10.3293 10.8605 3.7427 3.8341 4.8910 5.0183 14.5493 1.3751 1.4057 1.4249 1.4690 1.5818 1.5669 4.5939 4.5978 16.8531 3.0851 3.3054 1.5065 1.4619 4.1658 1.3698 1.4461 4.8040 3.6735 3.6684 2.3590 2.6774 4.4014 3.6792 1.5902 1.5920 1.4683 1.5150 2.7628 2.8644 1.2586 1.2676 1.1540 1.1489 1.1916 1.1885 1.3548 1.3971 2.0970 2.1276 1.4094 1.3987 2.0332 2.1700 4.8280 5.4274 3.2792 3.2637 1.9877 1.3204 1.2086 1.7414 1.1097 1.1148 7.8107 7.7906 5.8098 5.8120 11.9845 11.9362 1.0620 1.0620 1.0656 1.0656 1.0996 1.0996 1.1072 1.1072 1.0886 1.0887 1.0908 1.0907 1.0953 1.0953 1.0948 1.0948
irintensity: 0.1863 8.1490 6.7863 1.3016 3.8308 2.2300 1.6779 5.6035 2.6948 0.3997 0.0090 1.8625 2.7847 1.5089 0.5408 16.5768 1.4011 0.1641 4.4046 3.2529 32.2806 5.1805 4.2243 4.7512 31.2228 8.0777 0.5204 3.7956 1.2402 10.6762 60.3736 42.6448 107.4863 12.0358 41.0757 0.1456 2.1051 1.7627 70.4707 2.9340 39.9242 13.6897 4.6213 5.2983 0.2548 0.4268 5.3448 135.4652 18.2225 8.9097 18.7143 55.4261 4.7105 5.3646 140.4352 52.0003 63.0589 97.1426 1.1867 31.6515 2.6557 1.6918 0.5115 3.2893 5.7509 31.2950 14.8200 99.1371 8.3789 346.3436 98.4161 5.1167 2.4237 15.6578 54.6773 283.2456 94.8928 52.2847 7.4487 33.2467 6.2339 23.7926 2.5229 3.2264 21.1320 261.4467 96.8989 5.4076 16.2334 233.1583 100.5548 8.7812 16.2618 1.1439 32.1457 351.0122 54.0432 9.0802 53.0467 1.9607 0.1634 0.4580 6.4106 167.2107 87.9390 650.4421 51.3908 12.1848 43.5870 87.0635 1.4545 32.6909 14.3948 8.2943 30.0314 3.5588 0.3077 1.7266 2.1278 28.4978 7.2189 7.1951 4.5897
temp: 298.150 k
press: 1.00000 atm
elementType: 16 8 8 8 8 8 8 7 7 6 6 6 6 6 6 6 6 6 6 6 6 6 6 6 6 6 6 1 1 1 1 1 1 1 1 1 1 1 1 1 1 1 1
symmnumber: 1
zpe: 829251.1 jmol-1
zpe.correction: 0.315845 hartree
zpe.thermalcorrener: 0.339919 hartree
zpe.thermalcorrenthalpy: 0.340864 hartree
zpe.thermalcorrgfe: 0.258129 hartree
zpe.sumelectzpe: -1652.331076 hartree
zpe.sumelectthermal: -1652.307002 hartree
zpe.sumelectthermalent: -1652.306058 hartree
zpe.sumelectthermalfe: -1652.388792 hartree
dipole: 0.0020 -4.2240 0.0003
dipole: 4.2240
quadrupole: -121.4932 -200.0228 -163.0744
quadrupole: -0.0060 65.4645 0.0020
quadrupole: 40.0369 -38.4927 -1.5443 -0.0060 65.4645 0.0020
hfenergy: -1652.6469215 hartree
pointgroup: C01 [X(C18H16N2O6S1)]
dipole: 0.0018069 -1.661833 -0.0002152 debye
polarizability: 356.2024088|0.0903142|204.5295485|17.3286127|0.006002|237.35256 unknown
InChI: InChI=1S/C18H16N2O6S/c21-17-19(9-11-25-17)13-1-5-15(6-2-13)27(23,24)16-7-3-14(4-8-16)20-10-12-26-18(20)22/h1-8H,9-12H2
charge 0 multiplicity 1
43 atoms
S  -0.000654 2.63904 0.000563
O  6.653584 -2.355253 -0.257966
O  -6.649081 -2.363366 0.256799
O  -0.05845 3.413003 1.444359
O  0.056157 3.413459 -1.443029
O  5.202006 -1.704825 -1.963369
O  -5.198577 -1.7123 1.962815
N  4.950917 -0.921804 0.290872
N  -4.947817 -0.92784 -0.291016
C  5.600056 -1.217476 1.586729
C  -5.596386 -1.223603 -1.587131
C  1.506998 1.501575 0.073824
C  -1.506858 1.499681 -0.073015
C  3.787256 -0.110879 0.195594
C  -3.785107 -0.115582 -0.195291
C  6.900763 -1.935232 1.146461
C  -6.896437 -1.942919 -1.147464
C  2.077438 1.048021 -1.126147
C  -2.076737 1.045058 1.126816
C  2.046258 1.202565 1.332345
C  -2.045737 1.200374 -1.331626
C  3.22194 0.230503 -1.06842
C  -3.220222 0.226136 1.068839
C  3.193184 0.386717 1.391181
C  -3.19165 0.383124 -1.390711
C  5.542573 -1.643567 -0.76959
C  -5.538883 -1.650813 0.768974
H  4.95154 -1.864112 2.208405
H  5.818142 -0.290985 2.145154
H  -4.947069 -1.86928 -2.208966
H  -5.815297 -0.297074 -2.14517
H  7.77293 -1.259695 1.147393
H  7.120489 -2.839615 1.732117
H  -7.769314 -1.2683 -1.148241
H  -7.115095 -2.847251 -1.733597
H  1.653189 1.349122 -2.089591
H  -1.652863 1.346399 2.090351
H  1.59387 1.619858 2.238063
H  -1.593859 1.618506 -2.237213
H  3.677332 -0.147197 -1.985407
H  -3.675139 -0.152383 1.985715
H  3.614697 0.145362 2.370618
H  -3.612886 0.141552 -2.370219
