program: Gaussian 09
title: 000289823
version: EM64L-G09RevD.01
frameworkgroup: C1[X(C12H9NO4S)]
method: RPBEPBE
basis: SDD
operation: Freq
keyword: #p
keyword: freq=noraman
keyword: PBEPBE/SDD
title: #p freq=noraman PBEPBE/SDD
converged: YES YES NO NO
title: Mulliken charges:
elementType: S O O O O N C C C C C C C C C C C C H H H H H H H H H
charge: 0.803048 -0.274173 -0.542584 -0.522044 -0.426381 -0.699939 -0.123731 -0.120621 0.382186 0.391666 -0.491279 -0.442472 -0.324991 -0.318463 0.553973 0.310171 -0.406151 -0.328284 0.275867 0.279035 0.263117 0.268513 0.230243 0.263828 0.320443 0.313719 0.365305
chargesum: 0.00000
title: Mulliken charges with hydrogens summed into heavy atoms:
elementType: S O O O O N C C C C C C C C C C C C
charge: 0.803048 -0.274173 -0.542584 -0.522044 -0.061076 -0.065776 -0.123731 -0.120621 0.382186 0.391666 -0.215412 -0.163437 -0.061873 -0.049951 0.553973 0.310171 -0.175908 -0.064456
polarizability: 2.75255978e+02 1.11819591e+00 1.78206292e+02 2.35606633e+00 8.89340086e+00 9.32106287e+01
1716.lowfreq: -1.5270 -0.0012 -0.0011 0.0003 5.5567 6.5966 28.8161 93.4590 96.9872
frequency: 28.7929 93.4578 96.9853 109.7379 135.9819 168.1421 178.0228 216.2379 244.6345 291.6695 301.1889 310.8258 338.4011 354.8176 358.8732 367.6846 386.5629 399.0750 422.8406 428.9592 443.8325 470.2268 475.4751 501.7873 562.9059 568.9390 592.2575 661.6956 667.2141 689.0471 694.4153 726.3670 799.3146 809.0291 815.7458 823.5311 846.4622 858.3776 866.4231 884.7920 921.2050 946.5292 956.0661 1008.4615 1014.5752 1035.6113 1111.8704 1135.3562 1141.8093 1182.3836 1201.6548 1246.1223 1253.6993 1278.3010 1320.4228 1381.7218 1393.5532 1422.9522 1438.4794 1469.6403 1495.5362 1568.3309 1586.8519 1621.3181 1635.4596 1649.9000 3129.7698 3136.7910 3140.5159 3164.4131 3170.4073 3184.7214 3568.6657 3587.4246 3707.7087
redmass: 7.4218 4.2000 6.8488 10.1944 5.8252 9.2076 6.8408 6.4925 8.9108 7.4181 5.2993 8.6302 4.7011 1.1663 1.2144 3.2448 4.7834 1.2749 5.8500 5.5601 3.0995 5.7565 4.0351 9.3549 5.4464 4.5491 4.4093 7.2853 7.1420 3.4462 3.5850 6.8085 16.0818 6.4306 1.4400 1.4111 1.5661 1.7259 5.3006 6.7635 19.6422 1.3587 1.3440 2.7869 2.9808 1.5077 1.4445 1.3204 1.3057 2.1992 1.9268 2.0088 1.6814 2.1885 2.8592 3.8874 4.8893 4.8273 4.4608 3.0598 3.7419 7.6376 7.4715 6.5498 2.8518 1.5352 1.0922 1.0895 1.0916 1.0888 1.0956 1.0974 1.0452 1.0663 1.1042
irintensity: 4.8211 0.3804 1.1848 0.8097 0.7007 15.0658 1.2803 4.6178 3.8299 3.1508 3.2194 4.0878 3.7289 125.6330 30.2488 3.3339 14.5959 299.7315 14.0566 17.0250 4.7826 40.2835 39.5669 40.2206 0.7415 2.1877 3.2598 3.8535 8.4585 2.3859 7.7477 3.7466 76.4863 71.2446 41.8557 29.5210 43.9907 27.2597 12.7835 19.4618 89.8077 0.1989 0.2499 11.1895 6.7814 3.7590 114.9052 19.7107 207.5462 15.3572 176.7037 28.9119 45.6428 1.7981 13.9242 25.7732 62.8478 37.4532 4.1889 373.1062 158.2159 7.4646 9.9879 30.8919 4.7918 279.2462 8.6829 11.1047 13.2938 1.6453 4.2034 2.8574 112.6424 63.5654 25.8070
temp: 298.150 k
press: 1.00000 atm
elementType: 16 8 8 8 8 7 6 6 6 6 6 6 6 6 6 6 6 6 1 1 1 1 1 1 1 1 1
symmnumber: 1
zpe: 491659.0 jmol-1
zpe.correction: 0.187263 hartree
zpe.thermalcorrener: 0.203060 hartree
zpe.thermalcorrenthalpy: 0.204004 hartree
zpe.thermalcorrgfe: 0.144718 hartree
zpe.sumelectzpe: -1214.928986 hartree
zpe.sumelectthermal: -1214.913190 hartree
zpe.sumelectthermalent: -1214.912246 hartree
zpe.sumelectthermalfe: -1214.971532 hartree
dipole: -3.3296 3.3173 -3.0792
dipole: 5.6189
quadrupole: -70.8099 -109.7535 -123.9281
quadrupole: -4.5952 4.2764 5.5976
quadrupole: 30.6873 -8.2563 -22.4309 -4.5952 4.2764 5.5976
hfenergy: -1215.1162494 hartree
pointgroup: C01 [X(C12H9N1O4S1)]
dipole: 1.3268389 -1.2337743 -1.2666008 debye
polarizability: 275.2865679|1.2132328|178.9490812|0.3029497|-3.8797266|92.4372496 unknown
InChI: InChI=1S/C12H9NO4S/c13-7-1-3-9-11(5-7)18(15,16)12-6-8(14)2-4-10(12)17-9/h1-6,14H,13H2
charge 0 multiplicity 1
27 atoms
S  0.004424 1.538835 0.662233
O  -0.012125 -1.65195 0.661936
O  0.012035 2.821008 -0.355188
O  -0.028543 1.830849 2.268839
O  -5.007845 0.566557 -0.717311
N  5.033445 0.623566 -0.557295
C  1.419086 0.37574 0.270647
C  -1.401556 0.381002 0.221096
C  1.225423 -1.014636 0.395661
C  -1.229922 -1.011124 0.354987
C  2.659791 0.945231 -0.050818
C  -2.631544 0.958647 -0.142552
C  2.345703 -1.857018 0.223032
C  -2.35144 -1.850625 0.153924
C  3.785729 0.096931 -0.235907
C  -3.73634 0.105609 -0.350933
C  3.604442 -1.312943 -0.07572
C  -3.595682 -1.297441 -0.185728
H  2.740886 2.03296 -0.156879
H  -2.700051 2.047321 -0.259441
H  2.20429 -2.937893 0.315139
H  -2.220126 -2.931505 0.255814
H  4.460545 -1.984736 -0.205764
H  -4.469627 -1.934347 -0.34655
H  5.166649 1.625043 -0.661899
H  5.840001 0.018068 -0.676221
H  -5.025848 1.551952 -0.801806
