program: Gaussian 09
title: 000289821
version: EM64L-G09RevD.01
frameworkgroup: C1[X(C16H26O4)]
method: RPBEPBE
basis: SDD
operation: Freq
keyword: #pfreq=noraman
keyword: PBEPBE/SDD
title: #p freq=noraman PBEPBE/SDD
converged: YES YES NO NO
title: Mulliken charges:
elementType: O O O O C C C C C C C C C C C C C C C C H H H H H H H H H H H H H H H H H H H H H H H H H H
charge: -0.270409 -0.270421 -0.248945 -0.248933 -0.412894 -0.412893 -0.514987 -0.514971 0.126293 0.126240 0.169898 0.169885 -0.276912 -0.276841 -0.366604 -0.366623 -0.335714 -0.335706 -0.691033 -0.691045 0.208211 0.214885 0.208210 0.214886 0.263255 0.225081 0.263249 0.225080 0.236936 0.224893 0.224861 0.236912 0.188923 0.208612 0.208618 0.188924 0.173712 0.239946 0.173712 0.239958 0.202882 0.220414 0.213577 0.202883 0.220411 0.213585
chargesum: 0.00000
title: Mulliken charges with hydrogens summed into heavy atoms:
elementType: O O O O C C C C C C C C C C C C C C C C
charge: -0.270409 -0.270421 -0.248945 -0.248933 0.010202 0.010202 -0.026651 -0.026643 0.126293 0.126240 0.169898 0.169885 0.184917 0.184932 0.030930 0.030920 0.077945 0.077964 -0.054160 -0.054166
polarizability: 2.08808460e+02 -6.97738554e-03 1.62451619e+02 -2.34950104e-03 3.19959811e+00 1.87721678e+02
1716.lowfreq: -12.3216 -8.1573 -0.0006 -0.0001 0.0004 4.1169 24.3288 24.4585 33.3350
frequency: 23.9105 24.3023 32.9863 44.2368 50.7431 64.7734 68.8676 85.4729 91.4316 96.3600 98.3757 133.5658 149.0426 164.5874 218.2667 222.5665 229.1680 231.5720 248.1382 256.3024 258.2314 278.0967 287.6772 290.7569 336.1769 355.8110 363.3162 457.5572 476.9899 480.3738 527.0066 563.5048 567.4265 688.2858 718.4813 723.6439 734.3328 737.0252 770.6895 799.0136 808.3977 827.6976 828.5127 834.1061 869.2548 870.4059 902.3156 904.4475 906.7122 952.5528 952.5620 971.2438 1010.4392 1018.3859 1029.3730 1032.1394 1069.5875 1072.1887 1085.2196 1107.8669 1122.7619 1125.7900 1126.1158 1134.2030 1137.1736 1139.7925 1171.3916 1207.9579 1211.2943 1215.4180 1218.1500 1242.3527 1244.6083 1246.4221 1269.7612 1286.0131 1286.3078 1305.9410 1306.0360 1334.1564 1341.3775 1345.4678 1346.3427 1356.3698 1360.1339 1365.0468 1366.0957 1393.1201 1393.1379 1447.0802 1450.8533 1450.9267 1453.4729 1469.5337 1472.1233 1473.6983 1475.3762 1476.0001 1477.0936 1478.9054 1479.5501 1487.2216 1487.2661 1598.7633 1602.6051 1660.0854 2962.6732 2963.2921 2963.4186 2963.5352 2973.4746 2973.5400 2977.7548 2978.2300 2985.6837 2987.5483 3001.5493 3002.0294 3025.2426 3025.2968 3026.6987 3028.3175 3045.1839 3045.5610 3049.6414 3057.1052 3067.8692 3068.8405 3072.3358 3073.1308 3075.5624 3075.6644
redmass: 3.4652 6.1964 3.7715 4.3995 3.9100 2.4243 2.3377 2.6728 2.0472 2.7708 3.5126 3.1952 2.7040 3.8650 1.4920 1.1643 2.5550 7.5332 2.0117 2.1516 4.9061 2.6846 2.9767 2.1199 4.0326 3.4733 4.3465 2.4938 2.9304 2.7437 3.6618 3.2580 5.1129 5.5053 3.5685 3.5550 1.6549 1.3389 2.9098 1.7685 2.1263 1.6165 2.2219 2.1688 2.4461 2.5736 1.6300 1.7712 1.8150 1.3002 1.3013 2.5611 3.6631 4.2859 3.2275 3.4905 2.0699 2.1166 1.9332 1.6678 2.7698 2.0769 2.0794 1.1575 1.7608 2.0072 1.5046 2.8366 1.7741 1.6026 1.5988 1.2695 1.2737 1.2912 1.3014 1.1351 1.1325 1.2634 1.2646 1.3803 1.4063 1.5401 1.6328 1.3938 1.6701 1.6619 1.6949 1.2158 1.2151 1.1052 1.0829 1.0828 1.0790 1.0823 1.0860 1.0689 1.0910 1.0464 1.0499 1.0419 1.0479 1.0875 1.0889 10.4659 12.0264 8.4462 1.0646 1.0655 1.0655 1.0646 1.0371 1.0373 1.0606 1.0604 1.0658 1.0604 1.0597 1.0598 1.0926 1.0924 1.0920 1.0933 1.1000 1.1002 1.0986 1.1041 1.1058 1.1054 1.1020 1.1024 1.0992 1.0990
irintensity: 0.0221 3.2762 1.9846 0.2966 0.6962 0.6221 0.7247 0.4434 0.1632 0.1176 0.1615 3.0762 4.0623 0.3239 1.7204 0.0196 0.0474 11.6882 1.9421 0.4080 3.4288 0.0158 1.4356 2.6880 3.6821 0.4645 8.2689 4.3882 6.4373 1.2699 0.0136 1.0220 1.2487 43.3214 0.8871 4.0363 3.3074 0.2379 3.8260 13.9101 5.6849 1.2046 3.6264 0.3158 20.2784 9.1055 6.2779 0.3728 16.0819 5.7275 7.6427 21.2682 78.1075 54.3846 44.1107 69.2860 11.5166 31.0055 0.0507 34.2312 64.3522 4.9698 7.0847 0.2474 0.1846 1.1296 16.3017 279.7443 59.4458 99.0184 38.5855 4.3792 0.8828 5.2487 12.5826 0.4963 0.2067 2.4051 1.8148 0.4405 2.0182 0.0107 5.7480 0.7583 4.4371 0.4253 5.9986 15.5041 4.8745 1.4742 1.0102 11.3184 32.3944 9.3938 11.6410 2.4416 7.0898 5.7478 13.0794 10.6980 6.1806 26.1566 4.5558 4.1581 399.9088 31.1683 78.1558 42.3771 0.0069 0.9468 38.9795 19.9269 87.1771 12.5842 31.6084 35.2452 23.2459 11.1863 10.3837 3.9671 16.9181 1.0899 6.7501 16.3162 58.1464 54.9497 39.6651 4.2632 38.6295 126.3095 9.0688 82.2513
temp: 298.150 k
press: 1.00000 atm
elementType: 8 8 8 8 6 6 6 6 6 6 6 6 6 6 6 6 6 6 6 6 1 1 1 1 1 1 1 1 1 1 1 1 1 1 1 1 1 1 1 1 1 1 1 1 1 1
symmnumber: 1
zpe: 1031844.6 jmol-1
zpe.correction: 0.393009 hartree
zpe.thermalcorrener: 0.416049 hartree
zpe.thermalcorrenthalpy: 0.416993 hartree
zpe.thermalcorrgfe: 0.338061 hartree
zpe.sumelectzpe: -924.618481 hartree
zpe.sumelectthermal: -924.595441 hartree
zpe.sumelectthermalent: -924.594497 hartree
zpe.sumelectthermalfe: -924.673428 hartree
dipole: 0.3166 -0.0002 -0.0002
dipole: 0.3166
quadrupole: -103.3815 -118.0333 -132.9298
quadrupole: -0.0021 0.0027 -8.6129
quadrupole: 14.7334 0.0816 -14.8149 -0.0021 0.0027 -8.6129
hfenergy: -925.0114899 hartree
pointgroup: C01 [X(C16H26O4)]
dipole: 0.1245643 -0.000071 -0.0001019 debye
polarizability: 208.8084595|-0.0078117|162.1305264|-0.00454|1.4213661|188.0427717 unknown
InChI: InChI=1S/C16H26O4/c1-3-5-11-19-15(17)13-9-7-8-10-14(13)16(18)20-12-6-4-2/h3-12H2,1-2H3
charge 0 multiplicity 1
46 atoms
O  0.253193 1.219777 -0.814626
O  0.252823 -1.220334 0.81482
O  -0.438233 -0.073099 -2.629884
O  -0.438428 0.072261 2.630353
C  -4.401441 -0.28287 -0.718926
C  -4.401411 0.283661 0.718989
C  -3.162652 0.21711 -1.48986
C  -3.162862 -0.216745 1.490034
C  -1.881541 0.133269 -0.670916
C  -1.881646 -0.133315 0.671215
C  -0.633644 0.36279 -1.467655
C  -0.633891 -0.363363 1.468036
C  1.519667 1.539384 -1.543454
C  1.519082 -1.540627 1.543721
C  2.207289 2.673326 -0.782601
C  2.206737 -2.674119 0.782224
C  2.670055 2.290462 0.641846
C  2.670128 -2.290191 -0.64174
C  3.381124 3.455694 1.361553
C  3.380964 -3.455086 -1.36223
H  -4.389951 -1.38995 -0.673427
H  -5.320586 0.011514 -1.258259
H  -4.389538 1.390738 0.673492
H  -5.320706 -0.010409 1.258235
H  -3.005644 -0.364037 -2.418826
H  -3.314684 1.267411 -1.816616
H  -3.005746 0.364337 2.419023
H  -3.315271 -1.267001 1.816757
H  1.259099 1.820832 -2.580017
H  2.134592 0.620404 -1.576456
H  2.134152 -0.621773 1.577561
H  1.258165 -1.822795 2.579998
H  3.083912 2.996128 -1.381769
H  1.519772 3.54005 -0.730735
H  1.51908 -3.54068 0.729423
H  3.083079 -2.997556 1.381457
H  3.356981 1.420245 0.577264
H  1.793564 1.964228 1.232614
H  3.357403 -1.420331 -0.576158
H  1.793997 -1.963016 -1.23251
H  4.275373 3.787716 0.800218
H  3.707031 3.161901 2.375825
H  2.70644 4.326213 1.465236
H  4.274919 -3.787947 -0.800918
H  3.707283 -3.160549 -2.376152
H  2.705971 -4.325253 -1.466859
