program: Gaussian 09
title: 000289811
version: EM64L-G09RevD.01
frameworkgroup: C1[X(C16H8F2N2O4)]
method: RPBEPBE
basis: SDD
operation: Freq
keyword: #p
keyword: freq=noraman
keyword: PBEPBE/SDD
title: #p freq=noraman PBEPBE/SDD
converged: YES YES NO NO
title: Mulliken charges:
elementType: F F O O O O N N C C C C C C C C C C C C C C C C H H H H H H H H
charge: -0.186563 -0.189360 -0.119065 -0.170502 -0.205746 -0.159197 -0.044450 -0.015496 0.150506 -0.049080 0.086746 0.360285 0.323984 0.087061 -0.267914 -0.330703 -0.278906 -0.325174 -0.377016 -0.364745 -0.383976 -0.370705 0.335642 0.334931 0.251896 0.282109 0.273543 0.284548 0.267279 0.268196 0.265709 0.266163
chargesum: 0.00000
title: Mulliken charges with hydrogens summed into heavy atoms:
elementType: F F O O O O N N C C C C C C C C C C C C C C C C
charge: -0.186563 -0.189360 -0.119065 -0.170502 -0.205746 -0.159197 -0.044450 -0.015496 0.150506 -0.049080 0.086746 0.360285 0.323984 0.087061 -0.016018 -0.048594 -0.005364 -0.040627 -0.109738 -0.096548 -0.118267 -0.104542 0.335642 0.334931
polarizability: 3.44638165e+02 -5.54783753e+00 1.92608626e+02 -1.01837495e+01 -6.77458244e+00 1.26818892e+02
1716.lowfreq: -4.8862 -0.0009 -0.0003 0.0005 1.8468 4.5737 12.3081 26.4828 33.5972
frequency: 11.8613 26.4412 33.5791 47.5093 62.1883 88.4914 102.1367 107.5347 125.2739 139.6151 185.5777 211.6493 248.2893 271.1264 275.9660 292.9869 318.2305 331.9570 353.5419 368.6679 386.4605 408.2902 409.4830 413.6922 472.6896 485.7682 493.2460 503.0882 523.2230 585.5774 604.5766 613.9964 625.2392 632.2047 656.7192 694.0506 699.9012 721.7647 758.6158 771.1847 787.6021 794.9590 820.7165 822.2284 852.1608 855.1489 860.4209 906.7305 958.2241 960.3690 983.1822 986.4817 1001.9949 1004.2212 1018.1657 1094.1392 1111.0784 1112.0462 1157.1851 1160.3555 1197.8163 1208.0952 1212.3587 1240.5044 1291.7894 1294.7143 1298.9153 1374.5910 1382.8168 1386.8970 1407.6668 1417.9618 1421.0147 1492.3835 1493.1460 1532.1725 1565.4101 1591.3984 1595.8457 1609.5988 1611.2597 1630.8672 3155.5477 3161.5117 3162.1735 3171.3224 3182.4648 3183.0980 3185.7157 3189.2482
redmass: 10.1698 9.3063 4.1798 4.7022 11.1084 10.3165 10.4834 10.0395 11.7489 11.8514 11.5313 9.3733 9.2106 10.9010 9.5583 8.9583 12.9562 10.4633 12.5039 9.4890 6.4233 2.9375 3.0600 6.4500 7.9066 4.6375 3.5624 6.7807 6.4038 8.0254 7.7072 7.8820 7.2644 7.6987 6.7099 4.6658 8.4015 6.1198 4.9332 5.2394 7.2295 6.9578 1.2731 1.2646 2.7145 1.6913 2.9419 7.7798 1.3775 1.3657 1.3586 1.3553 3.0411 2.7553 7.5743 6.6315 1.2927 1.3099 1.3932 1.4522 3.2960 2.1180 3.5206 6.5646 6.2199 1.2969 1.2703 6.3738 5.6953 9.2538 7.5564 4.5080 5.2359 2.6403 2.6657 11.8919 11.1871 7.7592 8.1810 6.3776 6.5843 13.3991 1.0897 1.0892 1.0895 1.0891 1.0970 1.0963 1.0975 1.0975
irintensity: 0.5611 0.3326 0.0433 0.1375 0.0474 1.9888 4.2791 3.0498 1.1113 1.5446 2.7267 18.0292 7.2861 1.8578 1.4465 0.5811 28.1052 0.4010 0.6646 2.6594 6.5700 0.0130 0.4178 0.1445 2.3909 7.9368 5.9177 6.7686 8.1596 119.4019 3.8324 18.6711 2.8425 14.8187 8.1036 14.7038 12.4536 8.4282 27.9730 28.9239 1.2783 7.2357 3.3772 1.8171 92.0872 49.3952 172.3618 67.0724 2.1307 2.1213 0.9500 1.1703 8.3854 2.8285 21.1283 25.0029 13.1539 13.7515 191.1418 62.3764 2.1108 1.6297 68.1905 91.9566 489.3175 24.6501 7.4822 6.5778 8.8992 104.2269 41.1238 27.3622 82.9632 63.9834 30.2428 257.5746 208.9388 29.2599 82.3450 181.9688 98.5130 225.6987 5.2649 0.1434 0.0804 1.2019 3.2141 0.8679 3.1021 3.0162
temp: 298.150 k
press: 1.00000 atm
elementType: 9 9 8 8 8 8 7 7 6 6 6 6 6 6 6 6 6 6 6 6 6 6 6 6 1 1 1 1 1 1 1 1
symmnumber: 1
zpe: 544050.3 jmol-1
zpe.correction: 0.207218 hartree
zpe.thermalcorrener: 0.227240 hartree
zpe.thermalcorrenthalpy: 0.228184 hartree
zpe.thermalcorrgfe: 0.155516 hartree
zpe.sumelectzpe: -1222.802882 hartree
zpe.sumelectthermal: -1222.782860 hartree
zpe.sumelectthermalent: -1222.781916 hartree
zpe.sumelectthermalfe: -1222.854584 hartree
dipole: 0.1223 -1.0507 -0.6133
dipole: 1.2227
quadrupole: -136.8328 -140.1022 -133.9332
quadrupole: -3.6708 1.2082 -0.1656
quadrupole: 0.1233 -3.1461 3.0229 -3.6708 1.2082 -0.1656
hfenergy: -1223.0100998 hartree
pointgroup: C01 [X(C16H8F2N2O4)]
dipole: 0.4238278 0.2269597 0.0165141 debye
polarizability: 182.513388|-51.3552919|326.0437056|38.6693305|-11.2565744|155.5085889 unknown
InChI: InChI=1S/C16H8F2N2O4/c17-11-5-1-9(2-6-11)15(21)13(19-23)14(20-24)16(22)10-3-7-12(18)8-4-10/h1-8H
charge 0 multiplicity 1
32 atoms
F  -0.699227 6.789153 -0.766946
F  3.581309 -6.103143 1.151992
O  -1.855727 -1.345662 -2.134225
O  -0.874474 0.864962 1.749648
O  1.72198 -0.030787 0.294308
O  -3.086367 0.863857 -1.675859
N  -2.081757 0.175542 -1.371664
N  -0.710748 -1.834713 -1.572853
C  -1.029913 0.226459 -0.536295
C  -0.220552 -0.966259 -0.661166
C  -0.905613 1.27741 0.557813
C  -0.860727 2.708146 0.175553
C  1.716744 -2.447997 0.260638
C  1.121555 -1.11107 -0.005838
C  -0.714484 3.122891 -1.17639
C  -0.94981 3.684764 1.207519
C  1.010239 -3.672369 0.091999
C  3.059112 -2.475513 0.73781
C  -0.655928 4.490863 -1.500609
C  -0.898475 5.054514 0.900543
C  1.631483 -4.900883 0.38945
C  3.692797 -3.692682 1.037007
C  -0.75331 5.424024 -0.451758
C  2.958838 -4.881411 0.853541
H  -0.624589 2.381565 -1.97666
H  -1.055537 3.345385 2.242563
H  -0.02002 -3.670325 -0.27091
H  3.582552 -1.523503 0.869036
H  -0.538278 4.836299 -2.53107
H  -0.966639 5.824698 1.673485
H  1.10754 -5.852988 0.269819
H  4.722325 -3.735129 1.402618
