program: Gaussian 09
title: 000289736
version: EM64L-G09RevD.01
frameworkgroup: C1[X(C12H7N3O2)]
method: RPBEPBE
basis: SDD
operation: Freq
keyword: #p
keyword: freq=noraman
keyword: PBEPBE/SDD
title: #p freq=noraman PBEPBE/SDD
converged: YES YES NO NO
title: Mulliken charges:
elementType: O O N N N C C C C C C C C C C C C H H H H H H H
charge: -0.193758 -0.196961 0.025011 0.012729 0.003034 0.525505 -0.506186 0.366951 -0.385243 -0.357933 -0.195263 -0.289578 -0.172681 -0.274688 0.295276 -0.236987 -0.251928 0.291456 0.244814 0.295111 0.248903 0.238063 0.250815 0.263536
chargesum: 0.00000
title: Mulliken charges with hydrogens summed into heavy atoms:
elementType: O O N N N C C C C C C C C C C C C
charge: -0.193758 -0.196961 0.025011 0.012729 0.003034 0.525505 -0.214729 0.366951 -0.140430 -0.062821 0.053640 -0.051515 0.078134 -0.011152 0.295276 -0.236987 -0.251928
polarizability: 3.99800343e+02 1.34398364e+01 1.69170332e+02 -5.59725388e-02 6.65192963e-03 5.82159468e+01
1716.lowfreq: -3.1906 -0.0011 -0.0007 -0.0006 2.4168 4.1349 25.3928 41.7435 46.0917
frequency: 25.3445 41.7409 46.0916 63.6419 108.2005 127.6333 129.8415 170.4126 201.8621 221.3300 249.2366 269.9381 322.4211 347.8916 380.5445 424.2642 443.8996 454.1680 512.3612 533.8497 552.2559 588.7398 616.6362 650.8574 662.9646 681.6626 701.7750 751.1998 802.8593 821.2408 883.9797 907.3970 932.6772 943.0785 950.5465 986.4421 999.1470 1007.6369 1088.5875 1092.2912 1142.4244 1182.5413 1191.8347 1216.0581 1244.9337 1290.6495 1297.1042 1318.1782 1339.7432 1377.4430 1397.9287 1438.5332 1478.1801 1556.9867 1578.7042 1608.5203 1626.3088 2164.6786 2174.8722 3097.4562 3121.9709 3133.2670 3150.5618 3164.2630 3169.0674 3188.8788
redmass: 8.5222 9.7809 9.2586 8.6087 12.3574 5.5788 10.2433 4.8654 8.7934 2.6973 3.6962 8.3820 5.9302 4.0093 8.8372 3.2225 7.5108 8.0834 7.7894 4.6717 6.3401 12.1774 5.4640 7.1115 7.8968 2.0566 5.5946 8.9824 7.0567 1.4974 1.5430 4.2318 1.6023 1.4865 1.4807 6.1576 1.2042 1.3072 1.9050 1.6339 4.5961 1.3185 1.7412 6.0388 2.4748 1.4585 1.7833 1.4799 1.7052 10.7995 4.6322 3.5273 2.5651 6.4525 5.9217 5.7614 5.3266 12.6194 12.6360 1.0912 1.0922 1.0896 1.0877 1.0923 1.0942 1.0970
irintensity: 5.2951 0.5684 4.9745 0.3017 1.4778 1.9068 1.6930 2.2967 1.1278 3.9201 0.1415 2.4111 1.7413 0.0206 0.4628 0.3449 1.5340 0.0398 0.9492 3.4763 12.2615 0.1967 3.1562 0.4920 22.9763 22.4577 21.0587 16.4803 12.7274 34.7489 4.4477 0.4796 0.0009 0.2491 6.9019 1.6552 60.9437 25.1460 11.3986 31.2219 5.0143 91.2134 63.4963 196.6422 37.0093 0.3811 0.9002 15.6517 16.0931 102.9535 5.9260 23.7719 11.4616 76.8584 13.1197 58.2647 113.2058 5.5572 56.4019 7.4584 1.5222 15.2950 2.8507 3.7498 9.5902 5.9969
temp: 298.150 k
press: 1.00000 atm
elementType: 8 8 7 7 7 6 6 6 6 6 6 6 6 6 6 6 6 1 1 1 1 1 1 1
symmnumber: 1
zpe: 426754.2 jmol-1
zpe.correction: 0.162542 hartree
zpe.thermalcorrener: 0.177629 hartree
zpe.thermalcorrenthalpy: 0.178573 hartree
zpe.thermalcorrgfe: 0.117896 hartree
zpe.sumelectzpe: -774.877218 hartree
zpe.sumelectthermal: -774.862131 hartree
zpe.sumelectthermalent: -774.861187 hartree
zpe.sumelectthermalfe: -774.921864 hartree
dipole: 2.6365 1.6255 -0.0150
dipole: 3.0973
quadrupole: -161.6609 -100.3921 -98.5451
quadrupole: 13.3747 0.0171 -0.0025
quadrupole: -41.4616 19.8073 21.6542 13.3747 0.0171 -0.0025
hfenergy: -775.0397597 hartree
pointgroup: C01 [X(C12H7N3O2)]
dipole: 1.042101 -0.6313874 0.01774 debye
dipolederiv: -1.0104314 0.0898187 -0.0018062 -0.0378498 -0.4797676 0.0045723 0.0005502 0.004759 -0.2187927 -0.6263379 -0.0810749 0.0012681 -0.1851375 -0.7888579 0.0101765 0.0033118 0.0100857 -0.2203547 1.7977507 0.212638 -0.0033423 0.5199831 1.2003295 -0.0178932 -0.0093689 -0.018173 0.1892202 -0.3973525 0.0365828 0.0004677 0.1772071 -0.2175812 -0.0007402 -0.0019991 -0.0002108 -0.2229708 -0.2080586 -0.0020721 -0.0001087 -0.2720959 -0.217248 -0.0015361 0.0036072 -0.0004752 -0.2252694 -0.1037483 -0.0529799 0.000883 -0.013811 -0.1974067 0.004022 0.0014081 0.0039159 0.0347524 0.1683425 0.1166903 -0.0020598 0.0519135 -0.0367281 -0.0012863 -0.0000563 -0.0014651 -0.1181444 -0.4088869 -0.2080355 0.0036003 -0.143871 -0.1665003 0.0044711 0.00208 0.0043465 0.0763482 -0.0055009 0.0535063 -0.0014733 -0.1192033 0.0481527 -0.0029998 0.0011185 -0.0026501 -0.100408 -0.0888593 -0.0360177 0.000444 0.3289595 0.0183942 -0.001959 -0.0059827 -0.0021034 -0.0998543 -0.4152696 -0.0282981 0.0003783 -0.1522824 0.2135138 -0.0063028 0.0031565 -0.0061488 -0.1230688 0.890993 -0.1103044 0.0030302 -0.0929922 0.2144284 -0.0048041 0.0020392 -0.0049854 -0.1030524 -1.0468118 0.1075614 -0.0028282 0.0407661 0.0235436 -0.0023545 -0.0014143 -0.0024227 -0.1493441 1.2203858 0.0359971 0.0012597 -0.2491745 0.0406071 -0.0016985 0.0060137 -0.0016663 -0.0605409 -0.6510336 0.019392 -0.0016036 -0.2562988 0.2457013 -0.0017744 0.0029621 -0.0017124 0.1324087 0.3729242 -0.1713973 0.0018981 -0.3172238 -0.029742 0.0014057 0.0026385 0.0011484 0.0469997 -0.0080677 0.0856089 -0.0011404 0.503764 0.1194712 0.0006635 -0.0059099 -0.0001977 0.0540287 0.1636851 0.0221 -0.0003059 0.0642997 0.0417411 0.0023003 -0.0011366 0.0022052 0.1684481 -0.0006036 -0.0884029 0.0017855 -0.0711604 0.0633241 0.0014837 0.001273 0.0014513 0.1444318 0.0878797 0.0462562 -0.000799 0.0150405 0.1268577 0.0008608 -0.0002689 0.0008531 0.174103 0.0637067 0.0039782 -0.000085 0.0344689 -0.0693022 0.0041603 -0.0005373 0.004152 0.1565944 0.05217 -0.011507 0.0001901 0.0631106 -0.0701475 0.0034453 -0.0013879 0.0035732 0.1515608 0.0800519 0.0034419 -0.0002438 0.0575687 -0.0518639 0.0031295 -0.0010097 0.0031104 0.1621241 0.0730727 -0.0434819 0.0005911 0.0540189 -0.0309192 0.0026581 -0.001087 0.0026102 0.1507805 unknown
polarizability: 399.9909981|-11.6766875|168.9463077|0.5683043|-1.9111174|58.2493163 unknown
InChI: InChI=1S/C12H7N3O2/c13-8-11(9-14)5-1-3-10-4-2-6-12(7-10)15(16)17/h1-7H
charge 0 multiplicity 1
24 atoms
O  5.794332 0.28854 0.065747
O  4.507851 2.172274 0.031824
N  4.654034 0.890516 0.05454
N  -6.16652 1.834824 0.02956
N  -4.450102 -2.339424 0.099145
C  0.984943 -0.095441 0.072294
C  2.171532 0.688342 0.058229
C  3.424761 0.050404 0.06964
C  1.111902 -1.518734 0.098212
C  3.557859 -1.353897 0.095022
C  2.378826 -2.132675 0.109171
C  -0.306312 0.596914 0.059935
C  -1.555886 0.012656 0.066792
C  -2.76393 0.795529 0.053828
C  -4.051741 0.266006 0.059665
C  -5.206568 1.120087 0.045773
C  -4.281451 -1.154567 0.079281
H  2.131382 1.782034 0.038735
H  0.21685 -2.148798 0.110279
H  4.553892 -1.803825 0.103145
H  2.453658 -3.224197 0.129064
H  -0.255195 1.695851 0.04311
H  -1.664243 -1.079156 0.082239
H  -2.670577 1.889437 0.038571
