program: Gaussian 09
title: 000289719
version: EM64L-G09RevD.01
frameworkgroup: C1[X(C15H24O2)]
method: RPBEPBE
basis: SDD
operation: Freq
keyword: #pfreq=noraman
keyword: PBEPBE/SDD
title: #p freq=noraman PBEPBE/SDD
converged: NO YES NO NO
title: Mulliken charges:
elementType: O O C C C C C C C C C C C C C C C H H H H H H H H H H H H H H H H H H H H H H H H
charge: -0.300836 -0.249615 0.353896 -0.267152 -0.379698 -0.548733 0.012397 0.525311 -0.753830 -0.770836 -0.516503 -0.848087 -0.003075 -0.431360 -0.404570 -0.386380 -0.306601 0.240322 0.241092 0.222743 0.242468 0.230132 0.191062 0.204232 0.261544 0.224394 0.213976 0.211961 0.230947 0.229469 0.226901 0.224523 0.205701 0.202656 0.216238 0.213208 0.222887 0.198952 0.206009 0.200490 0.213764
chargesum: 0.00000
title: Mulliken charges with hydrogens summed into heavy atoms:
elementType: O O C C C C C C C C C C C C C C C
charge: -0.300836 -0.249615 0.353896 -0.026830 -0.138606 -0.083522 0.242530 0.525311 -0.096992 -0.120505 -0.285555 -0.167193 0.202627 -0.012466 0.031524 0.018581 0.107653
polarizability: 1.93670865e+02 -3.72258813e-01 1.54351970e+02 -1.68605083e+00 -1.31946279e-01 1.37670695e+02
1716.lowfreq: -14.3567 -5.6584 -0.0001 0.0005 0.0005 3.1643 27.0110 46.8263 66.4666
frequency: 24.2670 46.0134 66.3898 105.3547 128.6210 145.4892 169.0119 178.2030 189.9484 216.0623 217.0968 223.7416 275.7336 288.6687 340.5422 357.3133 382.0503 391.4021 410.6176 422.4643 441.1442 460.6132 488.8348 521.8594 536.7564 566.2475 632.9334 673.9641 704.0594 766.7107 773.9280 793.0571 809.0508 821.7662 847.6796 867.6020 877.0924 884.0498 896.5057 913.8780 934.3368 941.0976 944.3971 950.8738 971.3200 999.4501 1005.8746 1013.4507 1019.6738 1032.7563 1039.6795 1051.0307 1079.8376 1094.8904 1106.4795 1117.0069 1127.4313 1137.5496 1169.7029 1181.6530 1182.3340 1189.2074 1215.0274 1223.0929 1247.6328 1249.9562 1253.4270 1269.3668 1287.8336 1304.9421 1322.1405 1332.6125 1337.4437 1339.4264 1343.4362 1348.5596 1353.5129 1365.3413 1380.6529 1392.7625 1396.9439 1444.9850 1455.0997 1457.7219 1458.8298 1460.3664 1466.2220 1468.5499 1474.3917 1474.7180 1488.7568 1491.8636 1671.4240 2951.7569 2957.8383 2967.6715 2972.3248 2976.6734 2981.0165 2993.4539 2997.0361 3010.1527 3021.4839 3028.8740 3028.9179 3040.2311 3041.1019 3049.1846 3056.4339 3057.1677 3069.8300 3076.9350 3078.4512 3079.8700 3100.0277 3115.3515 3127.7854
redmass: 3.5978 3.7239 3.5005 3.4713 2.6928 2.6941 1.0582 1.2170 2.0568 2.6212 3.9070 1.2116 2.2298 2.7760 1.8714 2.9859 2.4191 2.5407 3.0590 3.3782 3.3571 3.2402 3.3586 2.5423 3.8929 3.1152 3.5493 3.2851 3.3413 4.0442 2.2048 1.7365 2.3172 1.7355 2.8401 2.4953 2.1389 2.2745 2.4113 2.4736 2.4933 2.4210 1.4134 2.1882 1.9407 1.3390 2.5721 1.4686 2.5369 2.4646 1.5311 1.9084 1.4332 1.3795 2.0327 1.9072 1.3784 2.0264 1.3011 1.7209 1.6412 1.9275 2.1657 1.8593 2.5628 1.5174 1.2451 1.2139 1.3131 1.5435 1.4047 1.8762 1.3069 1.3990 1.5071 1.5755 1.4297 1.2694 1.2122 1.2537 1.2013 1.0906 1.0889 1.0477 1.0543 1.0856 1.0598 1.0540 1.0790 1.0890 1.0525 1.0727 6.7246 1.0826 1.0374 1.0386 1.0383 1.0662 1.0596 1.0675 1.0639 1.0778 1.0701 1.0843 1.0943 1.0860 1.0998 1.0979 1.1008 1.0978 1.1026 1.0983 1.0984 1.1006 1.1057 1.0952 1.0927
irintensity: 0.0823 0.7327 0.9897 1.0220 1.6182 2.1907 0.0330 0.0296 1.0131 9.3170 2.3417 0.9637 4.2182 0.9166 4.4385 1.1136 0.1983 0.8027 5.4149 5.5316 0.7429 0.5216 1.2996 4.3787 2.0980 2.0292 1.2087 1.3788 4.4165 31.3750 3.7861 17.7836 2.6441 8.0168 14.6527 7.1334 21.5321 88.5273 1.3362 33.4589 153.3881 46.1123 8.3364 84.7430 8.1827 2.2306 39.2263 5.1014 42.2363 5.1708 3.7258 13.0238 0.8486 5.6541 14.9767 15.6235 2.7281 3.2989 4.6138 22.4266 11.1687 4.3699 0.6183 2.9504 16.1337 2.7948 7.2388 9.5569 6.7416 29.8512 5.5118 10.8956 7.5317 0.5515 3.2537 7.1370 1.1596 0.6619 17.1188 13.8646 18.3368 6.8127 13.3031 13.4474 5.0086 7.8786 11.4057 3.6809 0.1016 13.3274 18.9406 13.5929 10.2472 16.7972 38.8692 19.6903 67.6417 43.3387 40.3249 2.4823 51.3203 47.4070 29.2628 62.7029 34.1193 49.6459 24.6837 5.1235 32.7183 81.1350 43.7833 28.4246 39.3015 55.5410 44.6138 19.2359 15.7507
temp: 298.150 k
press: 1.00000 atm
elementType: 8 8 6 6 6 6 6 6 6 6 6 6 6 6 6 6 6 1 1 1 1 1 1 1 1 1 1 1 1 1 1 1 1 1 1 1 1 1 1 1 1
symmnumber: 1
zpe: 943275.6 jmol-1
zpe.correction: 0.359275 hartree
zpe.thermalcorrener: 0.376343 hartree
zpe.thermalcorrenthalpy: 0.377287 hartree
zpe.thermalcorrgfe: 0.314922 hartree
zpe.sumelectzpe: -735.042744 hartree
zpe.sumelectthermal: -735.025676 hartree
zpe.sumelectthermalent: -735.024732 hartree
zpe.sumelectthermalfe: -735.087096 hartree
dipole: -0.2390 0.2309 0.5056
dipole: 0.6050
quadrupole: -95.7363 -99.7478 -108.1127
quadrupole: 0.6488 3.2062 0.5553
quadrupole: 5.4627 1.4511 -6.9138 0.6488 3.2062 0.5553
hfenergy: -735.4020188 hartree
pointgroup: C01 [X(C15H24O2)]
dipole: -0.0943378 -0.0581076 -0.2106688 debye
polarizability: 193.5942933|-1.3027116|154.0903922|2.2817472|2.1569591|138.008844 unknown
InChI: InChI=1S/C15H24O2/c1-10-8-13(12-9-11(10)15(12,2)3)17-14-6-4-5-7-16-14/h8,11-14H,4-7,9H2,1-3H3
charge 0 multiplicity 1
41 atoms
O  0.908746 0.208792 -0.317397
O  2.610862 -0.176368 1.37082
C  -2.186405 1.226335 -0.140114
C  -1.206223 0.713724 1.001423
C  -2.978052 -0.135004 0.135635
C  -2.430472 -0.065955 1.613323
C  -0.207028 -0.361386 0.500853
C  -2.264276 -1.298503 -0.555629
C  -1.64673 1.503761 -1.553994
C  -2.996892 2.46143 0.320777
C  -0.918296 -1.390665 -0.359395
C  -3.070481 -2.263172 -1.391864
C  1.982568 0.804042 0.475524
C  2.982841 1.408928 -0.522264
C  3.736794 0.30348 -1.298497
C  4.38606 -0.6926 -0.307988
C  3.316687 -1.259144 0.641718
H  -0.710211 1.477973 1.625912
H  -4.069384 -0.136435 -0.028701
H  -3.041912 0.552757 2.289031
H  -2.216785 -1.034772 2.094694
H  0.265069 -0.848882 1.381934
H  -2.488586 1.705651 -2.246101
H  -0.995021 2.397718 -1.546144
H  -1.052366 0.668991 -1.95249
H  -3.439926 2.345936 1.324928
H  -2.347312 3.357596 0.340789
H  -3.821107 2.663795 -0.389764
H  -0.312534 -2.188121 -0.806023
H  -2.440036 -3.060104 -1.823619
H  -3.576469 -1.734797 -2.224561
H  -3.870109 -2.74161 -0.791831
H  1.582294 1.558718 1.18012
H  3.703306 2.024442 0.049943
H  2.433528 2.075471 -1.211139
H  4.503768 0.756935 -1.953371
H  3.020288 -0.234134 -1.947821
H  4.873796 -1.525975 -0.85039
H  5.166429 -0.177807 0.286315
H  2.576542 -1.857841 0.072075
H  3.753634 -1.883199 1.438589
