program: Gaussian 09
title: 000289715
version: EM64L-G09RevD.01
frameworkgroup: C1[X(C11H14O3)]
method: RPBEPBE
basis: SDD
operation: Freq
keyword: #pfreq=noraman
keyword: PBEPBE/SDD
title: #p freq=noraman PBEPBE/SDD
converged: NO YES NO NO
title: Mulliken charges:
elementType: O O O C C C C C C C C C C C H H H H H H H H H H H H H H
charge: -0.273926 -0.273392 -0.229054 0.345582 0.126812 -0.476648 -0.511326 -0.523695 0.354656 0.362078 -0.499073 -0.687273 -0.534511 -0.535275 0.233497 0.233488 0.266755 0.291118 0.268366 0.229605 0.209527 0.229504 0.227839 0.227839 0.242991 0.246051 0.224232 0.224233
chargesum: 0.00000
title: Mulliken charges with hydrogens summed into heavy atoms:
elementType: O O O C C C C C C C C C C C
charge: -0.273926 -0.273392 -0.229054 0.345582 0.126812 -0.009663 -0.244571 -0.232577 0.354656 0.362078 -0.230707 -0.018637 0.164158 0.159240
polarizability: 1.72811018e+02 -4.78034389e+00 1.59527927e+02 6.28065082e-03 2.13278804e-03 7.19901747e+01
1716.lowfreq: -0.0002 0.0008 0.0009 4.3117 10.2248 13.1970 44.9935 66.5373 84.8990
frequency: 44.9839 66.5271 84.8940 99.9843 112.0343 143.5510 166.6919 183.2343 202.4850 215.6287 234.6785 269.2428 273.5122 286.2856 329.8850 376.9999 431.8239 460.5590 499.3727 525.2235 601.0794 609.2300 614.6502 666.0356 691.3063 804.1827 823.7667 859.7160 873.6250 877.8306 893.6631 970.7411 980.0864 1012.2650 1037.5411 1049.6556 1070.2153 1092.1053 1113.5075 1114.6882 1142.2683 1157.1269 1167.0498 1177.7113 1248.3387 1263.6005 1287.4953 1338.1781 1395.0716 1407.3883 1425.7876 1434.4854 1442.0123 1452.3083 1456.7638 1466.5665 1467.2388 1467.4835 1474.7202 1476.6343 1477.3801 1579.4616 1605.0561 1611.3816 2959.8570 2965.5735 2972.9777 2996.2291 3019.6855 3047.9502 3055.1309 3091.8649 3100.5189 3127.3923 3128.1860 3171.5809 3175.7787 3176.9941
redmass: 5.2099 1.9289 2.6428 3.0521 3.8340 3.0279 3.4651 1.3534 1.5582 1.6784 3.5116 1.8156 1.8826 3.5224 5.2405 5.3259 5.7163 3.3308 5.6017 5.5528 4.1283 3.9531 2.8120 4.0901 1.9194 1.4362 5.4565 1.5386 1.4935 7.1017 1.5995 5.3074 5.5762 1.9890 3.2326 2.4449 1.6607 2.0427 1.2596 1.2599 1.6345 1.3716 1.6760 2.0665 1.1812 1.2460 4.3298 2.1485 1.2113 5.9675 1.5997 1.3095 1.2468 1.8532 1.9894 1.0493 1.0487 1.0393 1.0969 1.0566 1.1704 7.2195 7.2915 6.9236 1.0330 1.0326 1.0601 1.0364 1.0980 1.1040 1.1041 1.1001 1.0999 1.0995 1.1002 1.0905 1.0913 1.0918
irintensity: 3.9245 0.1519 9.5425 0.1937 2.2893 5.0963 4.0796 0.0238 2.0174 0.0005 2.0458 1.6493 0.2274 4.6135 0.6493 12.5241 9.0919 0.0440 2.7498 6.4950 0.1515 2.3052 0.5341 12.0674 16.2461 30.5842 20.6029 23.1207 3.4404 19.2526 38.8406 42.5746 16.8922 10.1579 40.1051 64.9146 1.7865 0.2781 0.0950 0.2877 131.1950 12.0232 106.8619 50.3943 0.2158 0.1430 216.3300 133.1112 26.3643 78.9960 43.9801 4.8267 17.9681 56.2741 11.8276 11.9282 12.3762 14.6834 18.6292 4.8034 36.4715 267.8814 57.1353 84.0193 60.9201 51.4058 33.8983 30.5172 8.4167 44.8100 43.7967 27.5684 31.9163 23.5649 25.2161 8.1038 0.2707 2.8960
temp: 298.150 k
press: 1.00000 atm
elementType: 8 8 8 6 6 6 6 6 6 6 6 6 6 6 1 1 1 1 1 1 1 1 1 1 1 1 1 1
symmnumber: 1
zpe: 593196.5 jmol-1
zpe.correction: 0.225937 hartree
zpe.thermalcorrener: 0.240708 hartree
zpe.thermalcorrenthalpy: 0.241653 hartree
zpe.thermalcorrgfe: 0.183965 hartree
zpe.sumelectzpe: -652.158518 hartree
zpe.sumelectthermal: -652.143746 hartree
zpe.sumelectthermalent: -652.142802 hartree
zpe.sumelectthermalfe: -652.200489 hartree
dipole: 2.6496 -1.1446 0.0002
dipole: 2.8862
quadrupole: -78.7758 -74.0182 -84.8162
quadrupole: 3.5197 -0.0003 0.0017
quadrupole: 0.4276 5.1852 -5.6128 3.5197 -0.0003 0.0017
hfenergy: -652.3844543 hartree
pointgroup: C01 [X(C11H14O3)]
dipole: 1.0544728 -0.4213213 -0.0007382 debye
polarizability: 173.0651358|-4.4057902|159.2737655|-0.0619179|0.0272823|71.9902191 unknown
InChI: InChI=1S/C11H14O3/c1-4-11(12)8-5-9(13-2)7-10(6-8)14-3/h5-7H,4H2,1-3H3
charge 0 multiplicity 1
28 atoms
O  2.244274 2.282775 0.000583
O  1.823808 -2.557418 -0.000704
O  -2.829761 1.316378 0.002728
C  -0.781161 0.047807 0.001448
C  -2.284217 0.173575 0.002202
C  -3.131289 -1.1037 0.00263
C  -0.135967 -1.207487 0.00075
C  -0.021076 1.250894 0.001393
C  1.385253 1.174931 0.000638
C  1.281314 -1.263927 -0.00004
C  2.048866 -0.080778 -0.000085
C  -4.644116 -0.828628 0.005139
C  1.625962 3.613084 0.001199
C  3.284208 -2.681198 -0.001589
H  -2.846522 -1.709519 -0.881772
H  -2.84375 -1.711134 0.884981
H  -0.688358 -2.150628 0.00077
H  -0.570142 2.196135 0.001902
H  3.141914 -0.084351 -0.000629
H  -4.939545 -0.241234 -0.881009
H  -5.209325 -1.778039 0.004684
H  -4.937105 -0.243612 0.893682
H  1.005965 3.766097 0.90546
H  1.005172 3.766568 -0.902436
H  2.468359 4.320007 0.001013
H  3.479713 -3.763351 -0.002085
H  3.726981 -2.220695 0.903171
H  3.725945 -2.220048 -0.906525
