program: Gaussian 09
title: 000289710
version: EM64L-G09RevD.01
frameworkgroup: C1[X(C13H18N2)]
method: RPBEPBE
basis: SDD
operation: Freq
keyword: #pfreq=noraman
keyword: PBEPBE/SDD
title: #p freq=noraman PBEPBE/SDD
converged: YES YES NO NO
title: Mulliken charges:
elementType: N N C C C C C C C C C C C C C H H H H H H H H H H H H H H H H H H
charge: -0.139309 -0.045506 -0.411547 -0.411902 -0.355146 -0.354936 0.437518 -0.675993 -0.676035 -0.347068 -0.347182 -0.399922 -0.399724 0.397016 -0.272345 0.219438 0.218145 0.219466 0.218186 0.228920 0.204663 0.228983 0.204576 0.211407 0.227119 0.209035 0.211456 0.227114 0.208987 0.233878 0.233791 0.248476 0.248441
chargesum: 0.00000
title: Mulliken charges with hydrogens summed into heavy atoms:
elementType: N N C C C C C C C C C C C C C
charge: -0.139309 -0.045506 0.026036 0.025749 0.078437 0.078622 0.437518 -0.028432 -0.028479 -0.113190 -0.113391 -0.151445 -0.151283 0.397016 -0.272345
polarizability: 2.55668632e+02 -6.88958814e-04 1.49011969e+02 5.89676092e-02 -1.04840566e+01 9.34201308e+01
1716.lowfreq: -7.5456 -0.0009 -0.0007 -0.0004 3.1335 4.9534 41.2942 41.8043 59.1663
frequency: 40.2083 41.7365 59.1106 68.9779 93.2433 116.1008 119.6088 138.2876 221.0726 224.0740 229.2952 237.1309 276.6875 282.9805 304.5458 365.0736 382.3064 418.3318 477.5774 489.4146 542.3084 552.7259 596.2444 646.0285 670.4131 731.3128 749.5495 752.5674 782.1836 808.5874 821.7187 866.3688 869.2232 883.9296 890.7600 952.9073 960.0389 979.2948 995.7811 1044.8533 1047.4152 1095.1344 1101.6587 1105.0874 1133.6189 1165.2728 1194.2657 1199.2160 1229.4188 1240.1870 1252.7990 1292.1880 1295.6388 1298.5269 1300.1953 1318.4744 1355.0970 1360.0913 1361.3209 1396.4779 1396.8787 1402.9790 1446.9403 1473.7389 1475.8825 1479.6721 1480.5064 1480.6015 1484.6195 1493.7181 1503.2896 1525.7091 1540.6644 1629.9355 2161.9953 2976.1950 2976.4761 2979.5717 2984.2085 2992.5988 2992.8210 3024.3029 3027.1640 3046.5811 3049.8583 3072.8193 3073.9780 3081.8775 3081.9810 3145.1636 3146.2481 3170.3849 3175.1423
redmass: 3.3874 4.9268 3.7354 2.7528 2.4192 2.8685 1.7742 5.3277 1.3048 1.1818 3.8991 2.9748 3.8061 2.3719 3.5979 2.9925 4.3576 3.1326 4.8995 3.1028 5.3677 3.6032 4.0721 6.9192 3.9305 3.7229 1.0949 1.1157 5.2310 1.2537 1.7678 1.5598 1.2684 1.6781 1.5062 1.3546 1.3553 3.0486 2.8701 3.0715 2.8806 1.8172 2.1088 2.1194 1.5631 2.0044 1.5028 2.2383 1.8663 1.4110 1.3258 1.1693 1.1308 1.3049 1.3127 1.3824 1.3588 1.4229 3.9946 1.2099 1.2126 2.0429 3.7401 1.0833 1.0511 1.0723 1.0423 1.0422 1.0853 1.0936 1.2244 2.4077 6.5308 6.1823 12.6209 1.0373 1.0364 1.0584 1.0606 1.0614 1.0610 1.0993 1.0989 1.1032 1.1029 1.1018 1.1020 1.0988 1.0988 1.0886 1.0885 1.0945 1.0956
irintensity: 0.0249 0.4005 1.3167 0.0556 1.2720 0.8040 0.0168 1.7033 0.0819 0.0014 1.0331 0.0829 0.0275 1.2992 0.5433 0.0870 9.8582 0.1014 1.4979 0.0171 9.1909 13.5731 0.6610 0.2223 6.3771 0.1919 4.2983 11.8963 1.9520 0.0014 80.0394 0.8748 2.6236 23.7197 2.3385 2.5678 0.7526 27.3540 0.4071 0.2025 3.1716 32.8332 8.5886 1.2127 1.3307 33.9297 56.3705 30.2732 3.1236 29.3607 3.5447 21.3468 1.8375 0.4837 2.0260 2.5578 5.6581 62.4226 1.1826 19.6284 17.5544 62.8449 4.1074 0.2295 0.4950 6.3333 10.3033 17.8382 0.2527 40.9042 27.3969 170.8787 4.9166 389.1440 169.9933 36.2155 26.4457 20.4725 20.4194 80.4379 33.5090 7.2267 0.4226 3.8011 9.2611 39.4872 116.7929 30.0366 46.7668 0.7872 12.6309 25.5031 7.4136
temp: 298.150 k
press: 1.00000 atm
elementType: 7 7 6 6 6 6 6 6 6 6 6 6 6 6 6 1 1 1 1 1 1 1 1 1 1 1 1 1 1 1 1 1 1
symmnumber: 1
zpe: 738090.8 jmol-1
zpe.correction: 0.281124 hartree
zpe.thermalcorrener: 0.297051 hartree
zpe.thermalcorrenthalpy: 0.297995 hartree
zpe.thermalcorrgfe: 0.236795 hartree
zpe.sumelectzpe: -614.542829 hartree
zpe.sumelectthermal: -614.526901 hartree
zpe.sumelectthermalent: -614.525957 hartree
zpe.sumelectthermalfe: -614.587158 hartree
dipole: 8.6618 -0.0020 0.0018
dipole: 8.6618
quadrupole: -126.2946 -81.8813 -93.2362
quadrupole: 0.0032 -0.0184 -3.1205
quadrupole: -25.8239 18.5894 7.2345 0.0032 -0.0184 -3.1205
hfenergy: -614.8239526 hartree
pointgroup: C01 [X(C13H18N2)]
dipole: 3.4076489 -0.0343275 0.0018355 debye
polarizability: 255.65828|-1.0489565|148.7868317|0.0037789|-11.0887717|93.6556202 unknown
InChI: InChI=1S/C13H18N2/c1-3-9-15(10-4-2)13-7-5-12(11-14)6-8-13/h5-8H,3-4,9-10H2,1-2H3
charge 0 multiplicity 1
33 atoms
N  1.438043 -0.011711 0.004926
N  -5.472463 0.056816 -0.002287
C  2.226238 1.137122 -0.487422
C  2.203398 -1.176711 0.495283
C  2.481556 2.227988 0.583504
C  2.438965 -2.269015 -0.578738
C  0.043641 0.001778 0.003748
C  3.342708 3.384503 0.033089
C  3.278667 -3.44275 -0.031744
C  -0.694606 1.167463 -0.394268
C  -0.717912 -1.149276 0.400434
C  -2.09558 1.175973 -0.398655
C  -2.118801 -1.130483 0.40204
C  -2.840238 0.029862 0.000914
C  -4.273962 0.043715 -0.000651
H  1.730716 1.58348 -1.370941
H  3.200068 0.751585 -0.846482
H  1.698338 -1.615863 1.37696
H  3.184029 -0.810916 0.856405
H  1.513063 2.615452 0.952241
H  2.984044 1.76338 1.454625
H  1.463624 -2.637384 -0.948951
H  2.950242 -1.810974 -1.448234
H  2.849489 3.880761 -0.824147
H  3.519362 4.151862 0.807468
H  4.329506 3.021662 -0.311925
H  2.775784 -3.933492 0.823055
H  3.442699 -4.210219 -0.808796
H  4.271316 -3.098713 0.315784
H  -0.17019 2.078821 -0.692288
H  -0.211902 -2.070659 0.699471
H  -2.629291 2.081215 -0.706657
H  -2.670654 -2.025168 0.70894
