program: Gaussian 09
title: 000289709
version: EM64L-G09RevD.01
frameworkgroup: C1[X(C21H16N2O3S)]
method: RPBEPBE
basis: SDD
operation: Freq
keyword: #p
keyword: freq=noraman
keyword: PBEPBE/SDD
title: #p freq=noraman PBEPBE/SDD
converged: YES YES NO NO
title: Mulliken charges:
elementType: S O O O N N C C C C C C C C C C C C C C C C C C C C C H H H H H H H H H H H H H H H H
charge: 0.988863 -0.568416 -0.503298 -0.505577 -0.473589 -0.100981 0.208910 -0.000077 0.049933 0.387720 0.299676 0.310846 -0.362200 -0.350748 -0.073007 -0.422238 -0.393981 -0.233804 -0.247561 -0.389884 -0.384829 -0.232197 -0.225227 -0.237948 -0.239809 -0.241913 -0.247844 0.328557 0.290371 0.211845 0.237878 0.268936 0.283078 0.283972 0.263488 0.251852 0.231975 0.235076 0.227372 0.227706 0.235789 0.229377 0.381909
chargesum: 0.00000
title: Mulliken charges with hydrogens summed into heavy atoms:
elementType: S O O O N N C C C C C C C C C C C C C C C C C C C C C
charge: 0.988863 -0.186508 -0.503298 -0.505577 -0.145032 -0.100981 0.208910 -0.000077 0.049933 0.387720 0.299676 0.310846 -0.071829 -0.138903 -0.073007 -0.184360 -0.125044 0.049274 0.036412 -0.126396 -0.132977 -0.000221 0.009849 -0.010576 -0.012104 -0.006124 -0.018467
polarizability: 5.31486191e+02 -1.05198959e+01 3.23543244e+02 -1.08781632e+00 -1.76675572e+01 1.47252210e+02
1716.lowfreq: -4.4784 -2.7690 -0.0017 -0.0005 0.0010 3.3182 16.7122 24.9353 33.2987
frequency: 16.6749 24.9099 33.2343 39.8973 44.8457 45.8298 70.0735 73.7596 112.6531 127.1875 131.8428 156.9739 164.2004 174.7640 205.8459 243.4220 250.6169 280.0916 282.9038 296.1692 312.9602 346.3191 358.4516 384.2590 402.8816 406.6398 407.3173 418.0160 442.4774 475.7620 500.5459 515.8794 533.3673 559.8007 596.7820 614.4263 616.5777 618.0209 656.1559 668.0054 682.0130 692.8022 700.1755 703.7229 710.1149 728.5965 743.2872 772.9461 782.3797 829.1521 832.0240 851.7840 857.9098 864.7796 924.9342 929.9622 935.0449 962.7080 963.6138 966.1261 979.2978 982.3143 987.6556 988.6735 989.4400 997.4806 1000.3001 1000.5356 1020.5689 1030.9084 1043.0618 1054.1367 1068.8858 1078.6995 1082.3180 1093.5440 1119.8664 1172.8216 1175.5274 1186.6888 1190.9223 1193.8003 1197.8788 1243.6707 1282.4599 1297.0327 1315.5948 1323.7039 1332.3885 1372.3476 1377.6688 1392.0756 1401.1383 1415.5883 1433.4417 1438.3056 1447.1796 1464.1436 1498.0346 1530.7846 1552.3637 1581.6765 1582.8712 1586.1169 1600.2068 1612.9109 1616.5262 3117.6424 3125.2006 3133.0881 3133.2756 3135.2352 3144.9792 3150.2420 3157.5385 3159.6371 3159.7806 3167.0860 3169.3189 3170.2968 3178.4380 3479.6904 3584.0004
redmass: 7.6047 5.9496 4.2832 6.4421 4.1022 4.5406 5.2019 5.1871 7.2621 5.6297 6.2289 10.0103 2.5970 2.1416 6.2559 4.7877 4.7629 6.4844 3.7684 6.5119 6.5042 7.6335 9.6229 6.0521 2.8375 2.8665 2.8506 8.7396 5.7214 4.8999 3.7169 5.1146 4.7930 6.6062 4.7196 6.4540 6.4667 6.9494 1.1819 6.5317 6.6557 6.6380 1.8608 1.9599 3.5413 5.9390 3.2239 1.8562 2.2335 1.5144 8.8526 1.2476 1.2459 1.4778 1.4253 1.5676 5.3612 6.1571 2.6982 2.5945 1.4248 1.4055 5.2080 5.1498 5.8496 1.3216 1.3732 1.3268 3.1032 2.0362 1.3253 2.2151 2.7051 1.7555 1.6314 2.0921 1.4539 1.0566 1.0556 1.2085 1.1163 1.1204 4.0899 3.2905 2.0595 1.4232 1.6631 1.4305 2.5625 5.5012 7.0008 9.7989 3.7239 3.6330 2.3373 2.3323 2.4002 2.2169 3.0239 5.3738 5.6242 5.9458 6.8917 6.4996 5.8368 6.0878 6.1008 1.0879 1.0848 1.0889 1.0866 1.0886 1.0921 1.0931 1.0958 1.0894 1.0956 1.0956 1.1004 1.1012 1.0971 1.0661 1.0808
irintensity: 0.7568 0.3467 0.1191 0.1303 1.5439 0.2201 0.1578 0.9586 1.8111 2.0704 3.9253 1.2228 29.5497 28.6595 5.2721 1.8408 12.2951 13.1099 52.8933 16.3128 20.3317 3.2405 5.1947 2.0703 0.3206 0.0095 0.0593 71.0353 4.9291 6.3926 19.0079 21.0032 67.5077 192.8512 14.7161 0.4116 0.6922 0.3789 72.9550 11.8515 5.6596 28.3614 74.7848 28.9982 2.4331 24.6919 10.2960 73.5038 24.4481 40.9088 100.4995 0.8853 1.0549 39.6316 4.9178 6.5501 6.8349 47.9790 29.0645 42.3557 2.0602 1.3797 0.2761 5.8394 1.9650 0.2709 0.9958 0.1445 6.3991 5.3912 46.2207 148.4886 3.4596 13.1546 6.2013 2.4231 8.2697 0.3591 0.2882 14.6700 2.4287 0.7844 6.1978 131.3352 19.3311 7.4763 4.6572 0.9041 7.7057 2.1817 0.3056 0.6446 0.7111 35.3883 25.3353 7.1244 3.1167 92.6220 23.5338 23.5039 25.5049 10.0713 3.6995 6.2303 220.4384 11.1863 6.3666 9.4305 1.4933 14.2477 0.8290 8.0033 14.7365 37.0887 29.0235 0.6122 15.6365 4.6353 17.5207 22.8708 0.5134 44.8015 27.5545
temp: 298.150 k
press: 1.00000 atm
elementType: 16 8 8 8 7 7 6 6 6 6 6 6 6 6 6 6 6 6 6 6 6 6 6 6 6 6 6 1 1 1 1 1 1 1 1 1 1 1 1 1 1 1 1
symmnumber: 1
zpe: 834656.2 jmol-1
zpe.correction: 0.317904 hartree
zpe.thermalcorrener: 0.341523 hartree
zpe.thermalcorrenthalpy: 0.342468 hartree
zpe.thermalcorrgfe: 0.261524 hartree
zpe.sumelectzpe: -1541.050356 hartree
zpe.sumelectthermal: -1541.026737 hartree
zpe.sumelectthermalent: -1541.025792 hartree
zpe.sumelectthermalfe: -1541.106736 hartree
dipole: 6.3935 -3.3319 1.2099
dipole: 7.3104
quadrupole: -177.6029 -147.8808 -169.8135
quadrupole: -6.1781 -15.0183 -4.4816
quadrupole: -12.5038 17.2182 -4.7144 -6.1781 -15.0183 -4.4816
hfenergy: -1541.3682601 hartree
pointgroup: C01 [X(C21H16N2O3S1)]
dipole: -2.4929596 1.2734164 0.6600347 debye
polarizability: 531.0448621|-14.3725571|315.3522097|0.1478048|41.9532923|155.8845737 unknown
InChI: InChI=1S/C21H16N2O3S/c24-27(25,26)18-13-11-17(12-14-18)21-22-19(15-7-3-1-4-8-15)20(23-21)16-9-5-2-6-10-16/h1-14,22,24H
charge 0 multiplicity 1
43 atoms
S  6.584267 -0.052806 -0.123614
O  6.821345 -0.370728 1.6955
O  7.109473 -1.350682 -0.935512
O  7.159348 1.421382 -0.465948
N  -0.345332 1.150293 0.171047
N  -0.29973 -1.070486 -0.172619
C  -1.687545 0.749805 0.116203
C  -1.635336 -0.656402 -0.087995
C  0.469791 0.034858 -0.015364
C  1.931892 0.050696 -0.031012
C  -2.76777 1.748046 0.208995
C  -2.721582 -1.655055 -0.16261
C  2.619449 -1.184166 -0.216123
C  2.684883 1.24997 0.125054
C  4.721291 -0.018091 -0.07521
C  -2.659979 2.842451 1.114266
C  -3.911002 1.672267 -0.63459
C  4.024133 -1.228875 -0.236882
C  4.092501 1.224036 0.107213
C  -2.488226 -2.872482 -0.859723
C  -3.977749 -1.464557 0.476049
C  -3.664225 3.832336 1.172442
C  -4.915919 2.658995 -0.568637
C  -3.490164 -3.861778 -0.935337
C  -4.978702 -2.456284 0.398958
C  -4.797653 3.744842 0.331656
C  -4.743181 -3.657363 -0.310377
H  -0.045122 2.12012 0.260538
H  2.024466 -2.093908 -0.335574
H  2.186925 2.216382 0.26338
H  -1.808133 2.897791 1.803644
H  -3.999585 0.845912 -1.347057
H  4.564818 -2.168232 -0.386886
H  4.686008 2.136931 0.215374
H  -1.511021 -3.026971 -1.327717
H  -4.16665 -0.552255 1.050885
H  -3.568273 4.66289 1.880312
H  -5.787721 2.586387 -1.227934
H  -3.294405 -4.792613 -1.479344
H  -5.938765 -2.296113 0.902438
H  -5.579064 4.510958 0.377712
H  -5.521811 -4.426096 -0.367898
H  7.805055 -0.469605 1.856292
