program: Gaussian 09
title: 000289700
version: EM64L-G09RevD.01
frameworkgroup: C1[X(C12H13NO2)]
method: RPBEPBE
basis: SDD
operation: Freq
keyword: #p
keyword: freq=noraman
keyword: PBEPBE/SDD
title: #p freq=noraman PBEPBE/SDD
converged: YES YES NO YES
title: Mulliken charges:
elementType: O O N C C C C C C C C C C C C H H H H H H H H H H H H H
charge: -0.312041 -0.268215 -0.461312 -0.393171 -0.240256 -0.483150 0.482022 -0.443691 -0.356805 0.254306 -0.195621 -0.210471 -0.256955 0.204479 -0.499788 0.230407 0.230404 0.224629 0.224616 0.230146 0.230142 0.329837 0.222711 0.299117 0.226866 0.226803 0.229329 0.275661
chargesum: 0.00000
title: Mulliken charges with hydrogens summed into heavy atoms:
elementType: O O N C C C C C C C C C C C C
charge: -0.312041 -0.268215 -0.131475 0.067640 0.208989 -0.022862 0.482022 -0.220980 -0.057687 0.254306 0.031245 0.016332 -0.027626 0.204479 -0.224127
polarizability: 2.31634033e+02 7.21471691e+00 1.33550655e+02 -5.84840675e-03 3.89929173e-03 6.90109540e+01
1716.lowfreq: -8.5891 -0.0011 -0.0009 0.0006 4.4363 4.7929 18.2125 44.9205 50.0238
frequency: 15.2474 44.9149 49.7903 64.9778 85.0947 99.1595 114.4279 155.5760 193.6040 213.2756 251.2397 311.9791 325.9334 337.9403 407.1518 416.9567 503.3525 508.8522 600.6890 615.5748 638.2885 643.9478 644.8821 695.6677 700.7552 709.5929 755.4499 766.3887 825.5281 840.2155 849.3298 899.7513 913.2886 954.9712 971.7086 984.6257 995.8318 1013.0197 1031.3979 1040.9923 1085.2101 1086.5607 1090.1067 1160.4475 1172.8928 1174.1227 1189.0646 1258.6352 1263.1990 1263.9486 1280.7753 1323.6228 1336.5575 1376.0359 1388.4154 1435.1656 1463.3906 1475.2011 1485.7849 1490.1926 1520.6124 1601.4499 1618.1761 1666.7443 2144.6819 2972.2586 2995.3005 3018.8350 3020.3512 3052.4726 3090.8074 3113.0362 3132.8153 3145.1045 3166.0988 3189.4700 3426.8876 3541.8766
redmass: 4.9258 5.5750 2.9143 6.2277 3.1912 2.3110 4.7437 3.7284 5.6714 5.5056 4.3000 5.1350 3.0498 6.9300 2.9155 6.0806 5.1399 2.8396 6.1756 6.4442 1.2299 1.3065 1.2283 2.1609 4.4936 8.5038 1.1026 1.6695 5.5853 1.2656 1.2661 8.1006 1.4309 4.8482 1.3558 6.1555 1.3056 5.8341 2.4275 3.5689 3.0371 1.5689 1.5566 3.3859 1.0510 1.1692 1.1146 1.9538 1.1883 1.3479 1.0700 1.4033 1.3768 1.6673 4.5987 2.3632 1.0833 1.0872 2.1624 1.1186 2.1897 5.2004 6.0662 8.7738 6.0375 1.0584 1.0574 1.1003 1.0593 1.1064 1.1062 1.0886 1.0868 1.0934 1.0996 1.0953 1.1591 1.0761
irintensity: 0.3181 0.3270 1.3462 3.0116 0.1927 0.6140 0.1405 4.8033 7.2024 0.3497 3.6890 10.9410 7.9216 3.6555 0.0052 0.4681 19.8650 26.4097 0.7666 2.5508 72.3960 32.0672 76.7467 16.4824 69.8151 22.8680 5.1357 108.4243 3.8566 0.4643 0.1037 7.5813 13.7410 37.6264 0.0819 1.9650 2.3947 190.2848 24.6089 36.4435 64.9215 0.1298 37.7216 473.8939 0.8143 0.9939 9.8148 8.4355 0.5891 4.3337 0.0000 60.7307 2.3983 53.6277 21.0278 105.9816 3.0411 6.6723 13.1239 40.2626 504.6900 32.8308 102.7345 239.9719 10.9354 18.1272 23.8731 9.5009 23.9029 6.7162 47.8096 14.1914 0.7507 30.4639 23.3315 6.1745 71.0825 29.3360
temp: 298.150 k
press: 1.00000 atm
elementType: 8 8 7 6 6 6 6 6 6 6 6 6 6 6 6 1 1 1 1 1 1 1 1 1 1 1 1 1
symmnumber: 1
zpe: 582627.3 jmol-1
zpe.correction: 0.221911 hartree
zpe.thermalcorrener: 0.236872 hartree
zpe.thermalcorrenthalpy: 0.237817 hartree
zpe.thermalcorrgfe: 0.177259 hartree
zpe.sumelectzpe: -669.132342 hartree
zpe.sumelectthermal: -669.117380 hartree
zpe.sumelectthermalent: -669.116436 hartree
zpe.sumelectthermalfe: -669.176993 hartree
dipole: 0.1497 1.7906 -0.0012
dipole: 1.7969
quadrupole: -79.5975 -84.2140 -91.8376
quadrupole: -3.2589 -0.0119 -0.0005
quadrupole: 5.6189 1.0023 -6.6212 -3.2589 -0.0119 -0.0005
hfenergy: -669.3542528 hartree
pointgroup: C01 [X(C12H13N1O2)]
dipole: 0.0574978 -0.7046034 -0.0006891 debye
polarizability: 231.6046658|-7.4113744|133.5798101|-0.066675|0.1122831|69.0111667 unknown
InChI: InChI=1S/C12H13NO2/c1-2-3-7-10-15-12(14)13-11-8-5-4-6-9-11/h1,4-6,8-9,13H,3,7,10H2
charge 0 multiplicity 1
28 atoms
O  1.125975 -0.223318 -0.001672
O  -0.236921 1.70046 0.001861
N  -1.113267 -0.50842 -0.001165
C  3.543096 -0.257344 -0.002639
C  2.318989 0.660049 -0.001372
C  4.854976 0.578164 -0.002106
C  -2.521331 -0.303587 -0.000329
C  -3.347375 -1.459709 -0.002304
C  -3.112733 0.987445 0.002418
C  -0.115451 0.450489 0.000144
C  -4.750505 -1.328167 -0.001525
C  -4.519824 1.100174 0.003153
C  -5.347655 -0.045821 0.001209
C  6.065302 -0.262202 -0.003467
C  7.075761 -0.969252 -0.004335
H  3.519452 -0.910647 -0.892982
H  3.51987 -0.912452 0.886388
H  2.28426 1.307823 0.894886
H  2.283546 1.309365 -0.896487
H  4.872712 1.24065 0.886581
H  4.872161 1.242655 -0.889307
H  -0.779393 -1.47482 -0.002895
H  -2.891444 -2.458152 -0.004448
H  -2.475157 1.873904 0.003923
H  -5.375975 -2.227676 -0.003065
H  -4.970869 2.098857 0.005286
H  -6.437828 0.056722 0.001806
H  7.957129 -1.583889 -0.003956
