program: Gaussian 09
title: 000289699
version: EM64L-G09RevD.01
frameworkgroup: C1[X(C20H14N4O8)]
method: RPBEPBE
basis: SDD
operation: Freq
keyword: #p
keyword: freq=noraman
keyword: PBEPBE/SDD
title: #p freq=noraman PBEPBE/SDD
converged: YES YES NO NO
title: Mulliken charges:
elementType: O O O O O O O O N N N N C C C C C C C C C C C C C C C C C C C C H H H H H H H H H H H H H H
charge: -0.293514 -0.293486 -0.215539 -0.215543 -0.211457 -0.211460 -0.250199 -0.250149 -0.456807 -0.456812 0.021396 0.021400 0.510217 0.510174 0.392193 0.392174 -0.321547 -0.321521 -0.420594 -0.420590 -0.357798 -0.357788 -0.342630 -0.342620 0.278495 0.278519 -0.404651 -0.404704 0.122862 0.122846 -0.054124 -0.054041 0.309098 0.309090 0.237839 0.237833 0.288665 0.288665 0.289546 0.289545 0.342819 0.342811 0.260805 0.274927 0.260778 0.274877
chargesum: 0.00000
title: Mulliken charges with hydrogens summed into heavy atoms:
elementType: O O O O O O O O N N N N C C C C C C C C C C C C C C C C C C C C
charge: -0.293514 -0.293486 -0.215539 -0.215543 -0.211457 -0.211460 -0.250199 -0.250149 -0.113988 -0.114001 0.021396 0.021400 0.510217 0.510174 0.392193 0.392174 -0.012449 -0.012431 -0.182756 -0.182757 -0.069132 -0.069123 -0.053084 -0.053075 0.278495 0.278519 0.131081 0.130951 0.122862 0.122846 -0.054124 -0.054041
polarizability: 5.31646468e+02 5.32521557e-01 2.62101021e+02 5.33750533e+01 -3.47354635e-01 2.18091332e+02
1716.lowfreq: -3.2706 -1.7469 -0.0011 0.0006 0.0010 1.3058 3.4945 5.6691 8.8423
frequency: 2.4279 3.6989 8.8141 15.6340 20.7347 37.0376 45.0792 60.0885 61.8781 75.8968 75.9407 83.2476 83.7606 103.3741 105.7022 139.8247 141.4084 183.0787 187.2143 208.1312 209.6809 223.1996 239.2429 274.1540 300.7128 309.2787 309.5603 314.9229 321.8835 354.2370 355.0211 398.8247 416.2263 416.2823 417.6907 480.4311 489.3570 502.3501 502.3642 505.8500 508.2830 508.3110 552.5800 618.3729 618.4321 641.8807 646.0677 646.8917 654.4452 665.2799 667.0043 667.3950 674.2935 677.1769 706.2506 706.9149 736.6954 736.7311 771.7814 771.9971 825.3185 828.0485 836.3092 836.4491 874.3625 874.4290 877.6705 881.2070 952.5511 966.2390 972.4604 979.9494 980.0613 997.8574 998.8737 1000.5715 1002.1815 1005.0419 1005.1063 1096.7240 1096.7959 1119.9868 1120.2632 1145.7062 1152.7340 1182.0343 1182.1200 1225.9917 1226.4558 1236.4369 1240.5964 1268.2669 1268.5434 1291.0604 1303.6853 1303.9116 1336.4566 1351.4029 1358.1307 1358.6698 1397.2529 1398.0803 1429.4831 1430.0550 1430.3529 1430.7914 1485.8241 1485.8704 1517.8512 1520.5980 1599.8189 1599.9736 1615.1836 1615.7669 1676.0055 1676.0374 2185.6321 2297.7112 3010.5762 3010.6573 3084.9230 3085.0237 3134.1765 3134.2380 3178.5754 3178.5802 3186.0440 3186.1341 3198.0165 3198.1173 3534.3619 3534.4317
redmass: 9.3070 8.6780 8.7871 5.6162 6.4327 9.9421 9.0569 12.6201 12.6670 9.7599 9.1735 6.2047 6.5839 5.5085 6.1043 6.4426 6.0026 8.3380 8.0650 6.2096 5.7082 7.4768 10.6227 8.8498 3.3705 5.8086 5.2385 3.8709 6.0461 5.7092 7.1320 8.9785 3.0646 2.9990 8.6644 7.0229 8.8923 3.0317 3.0396 8.8776 7.4740 7.4708 9.7841 6.8464 6.8470 4.2257 5.0278 2.8484 1.6530 3.0158 4.5532 3.7961 6.6429 6.1706 3.8309 3.9874 4.5544 4.5554 8.9596 8.9670 6.7505 6.5024 1.3513 1.3511 1.5271 1.5272 6.8725 7.1064 4.9066 3.8002 3.9837 1.3444 1.3443 2.8043 2.9523 3.0115 2.8610 1.3285 1.3292 3.0018 3.0028 1.3011 1.2924 3.4578 3.5626 1.4343 1.4340 4.1568 4.2863 1.0950 1.0886 2.0288 2.0274 2.8312 1.4001 1.3975 1.2580 1.8058 7.1722 5.8239 6.3083 6.4810 1.7570 3.7394 1.7627 1.1648 2.2877 2.2966 2.4755 2.4956 6.1992 6.1303 6.0394 6.0760 8.3132 8.3448 11.7841 11.8839 1.0594 1.0594 1.1021 1.1021 1.0910 1.0910 1.0901 1.0901 1.0947 1.0947 1.0964 1.0964 1.0763 1.0763
irintensity: 1.7000 2.8796 0.4556 0.3877 1.2022 0.4066 1.1314 1.1482 6.4134 2.1928 1.3069 4.3365 0.1306 0.1031 0.0106 1.0802 0.0984 6.0065 0.1258 5.5763 7.7846 1.5225 2.9409 0.7335 77.0610 6.3846 0.1734 0.1257 0.9816 0.0233 20.5279 2.9977 0.5452 0.0116 15.9078 1.7214 1.7738 31.1323 14.7835 0.5704 0.3266 1.6041 8.9624 13.6304 0.7811 0.3498 29.3337 1.7456 52.3311 0.0439 66.1030 4.2008 3.8431 9.2388 83.9755 8.7205 24.7797 1.8150 13.8559 0.1447 134.1760 19.0074 40.7194 17.0134 66.8846 83.8362 4.1216 5.9293 426.2143 52.3850 444.0420 0.6683 0.5963 445.9034 9.1459 250.4833 34.6388 0.9854 0.6443 17.6789 14.5733 80.9236 24.5239 1565.6510 90.1394 177.8631 46.9935 657.5320 48.3823 8.3453 0.3645 7.6328 13.5806 5.8273 56.8383 13.5614 93.9035 18.4281 115.7404 60.4516 257.2394 223.9462 77.6770 108.1844 7.6490 17.9640 8.3390 0.3220 1273.0475 138.5022 68.3546 51.8485 454.2708 83.4239 48.5920 341.8928 35.2090 0.1560 30.7308 12.9917 6.1517 0.1225 11.2968 10.4152 2.7716 1.8579 3.1402 3.0834 2.7678 2.8738 48.4988 42.9465
temp: 298.150 k
press: 1.00000 atm
elementType: 8 8 8 8 8 8 8 8 7 7 7 7 6 6 6 6 6 6 6 6 6 6 6 6 6 6 6 6 6 6 6 6 1 1 1 1 1 1 1 1 1 1 1 1 1 1
symmnumber: 1
zpe: 832408.5 jmol-1
zpe.correction: 0.317048 hartree
zpe.thermalcorrener: 0.346532 hartree
zpe.thermalcorrenthalpy: 0.347476 hartree
zpe.thermalcorrgfe: 0.245809 hartree
zpe.sumelectzpe: -1588.828688 hartree
zpe.sumelectthermal: -1588.799204 hartree
zpe.sumelectthermalent: -1588.798259 hartree
zpe.sumelectthermalfe: -1588.899927 hartree
dipole: 0.0133 0.4590 -0.0254
dipole: 0.4599
quadrupole: -367.1548 -179.7885 -172.1753
quadrupole: -0.4887 -56.5118 0.0346
quadrupole: -127.4486 59.9177 67.5309 -0.4887 -56.5118 0.0346
hfenergy: -1589.1457354 hartree
pointgroup: C01 [X(C20H14N4O8)]
dipole: 0.0062328 0.1806427 -0.0078975 debye
polarizability: 506.3304739|0.7069559|262.1054938|100.7261199|0.1622763|243.4028526 unknown
InChI: InChI=1S/C20H14N4O8/c25-19(21-15-5-9-17(10-6-15)23(27)28)31-13-3-1-2-4-14-32-20(26)22-16-7-11-18(12-8-16)24(29)30/h5-12,21-22H,13-14H2
charge 0 multiplicity 1
46 atoms
O  -3.650687 -0.719097 1.722045
O  3.658973 -0.715645 -1.726652
O  -10.336075 2.513076 -2.701517
O  10.321115 2.560077 2.699907
O  -10.405913 0.335489 -3.384503
O  10.393323 0.387157 3.397358
O  -4.894919 -2.103338 0.266971
O  4.901832 -2.088041 -0.259268
N  -5.352291 0.207741 0.570764
N  5.354694 0.222243 -0.575638
N  -9.887008 1.299627 -2.696963
N  9.874827 1.345591 2.70159
C  -6.477543 0.424986 -0.256313
C  6.476485 0.447329 0.254031
C  -8.711689 0.999124 -1.855862
C  8.703361 1.03692 1.858077
C  -7.078132 -0.608808 -1.02884
C  7.07662 -0.580102 1.035351
C  -7.010713 1.745265 -0.298296
C  7.006472 1.76908 0.289466
C  -8.196272 -0.315718 -1.82747
C  8.191096 -0.279281 1.836225
C  -8.126357 2.03715 -1.095678
C  8.118486 2.068671 1.089044
C  -4.670785 -0.983972 0.78057
C  4.676702 -0.972358 -0.780373
C  -2.730401 -1.86797 1.994089
C  2.742418 -1.868451 -1.994636
C  -1.556212 -1.84189 1.125159
C  1.567153 -1.842266 -1.127157
C  -0.548644 -1.836268 0.401197
C  0.558934 -1.83661 -0.404103
H  -6.665347 -1.618511 -0.995543
H  6.666337 -1.590975 1.006955
H  -6.54747 2.541111 0.296786
H  6.543599 2.559998 -0.312433
H  -8.676895 -1.09052 -2.430495
H  8.671245 -1.049078 2.445999
H  -8.551102 3.04294 -1.142048
H  8.540776 3.075707 1.130505
H  -4.98277 1.008821 1.089006
H  4.985056 1.019236 -1.100061
H  -2.453634 -1.743104 3.054094
H  -3.2947 -2.809844 1.857929
H  2.466532 -1.74893 -3.055482
H  3.309324 -2.80806 -1.853787
