program: Gaussian 09
title: 000289688
version: EM64L-G09RevD.01
frameworkgroup: C1[X(C25H30N2O)]
method: RPBEPBE
basis: SDD
operation: Freq
keyword: #p
keyword: freq=noraman
keyword: PBEPBE/SDD
title: #p freq=noraman PBEPBE/SDD
converged: YES YES NO NO
title: Mulliken charges:
elementType: O N N C C C C C C C C C C C C C C C C C C C C C C C C C H H H H H H H H H H H H H H H H H H H H H H H H H H H H H H
charge: -0.268114 -0.140782 -0.059980 -0.408659 -0.411100 0.417676 -0.357450 -0.357812 -0.385818 -0.374814 -0.678110 -0.677756 0.533041 -0.442678 -0.421781 -0.336888 0.456785 -0.361798 0.200854 -0.115128 -0.334540 -0.347855 -0.558478 0.331647 -0.345078 -0.346712 -0.242191 -0.685933 0.218491 0.214807 0.215834 0.217888 0.202480 0.231265 0.203035 0.230823 0.226592 0.225189 0.224887 0.211186 0.207736 0.224980 0.210662 0.208124 0.228574 0.220469 0.272067 0.216015 0.240030 0.225546 0.253423 0.257181 0.246810 0.207455 0.207507 0.232134 0.232125 0.206139
chargesum: 0.00000
title: Mulliken charges with hydrogens summed into heavy atoms:
elementType: O N N C C C C C C C C C C C C C C C C C C C C C C C C C
charge: -0.268114 -0.140782 -0.059980 0.024638 0.022621 0.417676 0.076295 0.076046 -0.159226 -0.149626 -0.034301 -0.033989 0.533041 -0.214104 -0.201312 -0.064821 0.456785 -0.145783 0.200854 -0.115128 -0.094510 -0.122308 -0.305055 0.331647 -0.087897 -0.099902 0.172771 -0.015535
polarizability: 8.10126110e+02 2.50852800e+00 2.94366070e+02 5.80035093e-01 1.97697760e+01 1.55291718e+02
1716.lowfreq: -2.2194 -0.0015 0.0007 0.0023 2.9708 5.0476 14.7188 22.2261 24.6586
frequency: 14.7089 22.2251 24.6278 35.9355 39.1744 53.4568 58.8859 65.4096 77.4521 97.1410 106.4336 108.4732 112.2255 130.1727 139.4051 176.4014 192.2793 201.4638 211.6997 221.1018 237.1946 240.2430 248.9153 272.3875 286.6653 289.8345 307.9547 331.7507 353.1550 382.1647 401.0497 407.7081 409.5538 420.1317 427.9150 474.7927 498.2783 516.0756 519.7305 529.9114 576.3656 584.0718 592.8703 615.2293 638.2367 693.2095 695.6301 729.0491 736.6614 745.2602 747.5081 751.0982 782.0960 801.3639 810.6171 811.9091 818.9125 826.3820 838.2243 843.9161 861.3931 866.6226 878.7273 879.4652 888.4402 895.7285 902.0710 942.1010 953.3525 953.6511 959.8841 964.7109 979.8193 980.1987 996.0930 1003.3944 1036.4550 1044.8440 1047.8513 1095.5192 1100.3698 1103.7939 1116.5497 1121.4212 1131.5907 1135.1986 1150.2652 1162.9812 1163.9613 1186.3716 1198.0630 1201.9347 1227.3967 1238.4742 1245.0564 1250.8013 1256.2465 1264.4182 1290.4461 1293.1276 1297.7030 1299.3668 1300.2056 1309.6217 1327.3415 1337.6529 1349.8046 1355.3548 1358.2527 1371.8093 1375.4812 1388.2286 1389.1862 1392.1921 1399.2387 1402.3561 1412.7260 1446.6838 1461.2673 1469.2540 1471.6709 1475.1405 1477.2780 1478.0649 1478.5175 1479.1921 1483.5423 1489.6536 1491.6822 1494.9989 1501.7513 1525.2429 1534.5572 1548.4696 1585.6311 1621.3941 1630.1535 1644.1293 2953.6902 2973.2300 2974.3666 2975.9676 2980.7945 2990.4767 2990.9999 2996.6342 3012.2794 3021.4858 3024.8822 3044.0810 3046.9309 3071.2496 3072.5772 3079.2228 3079.7152 3093.7520 3098.3115 3106.2715 3108.3942 3119.1913 3122.5664 3129.0046 3144.2440 3148.2754 3148.8238 3157.8121 3162.7875 3170.5536
redmass: 4.3857 3.9867 4.4636 4.0938 3.5465 3.7244 4.4821 2.5965 2.6122 2.3167 1.9508 2.2292 2.8312 3.8717 4.9269 3.5512 3.3506 2.9669 1.2094 1.4549 2.4982 2.7649 1.4034 2.6948 3.8929 3.1691 3.5917 3.7983 3.7541 4.0427 3.3009 3.6264 4.0090 4.1750 3.1381 3.1565 4.1316 4.8724 2.3809 5.2049 4.8755 2.8833 3.9334 6.6010 6.7474 3.4519 5.0303 3.4548 3.3201 1.4816 2.3963 1.1855 2.2288 1.2957 1.6016 4.0732 1.4973 1.5847 1.3713 4.1229 1.5656 1.2555 1.7571 1.7501 1.5178 1.7650 4.0298 1.3600 2.6461 1.4082 1.3432 4.4371 1.3864 3.1222 2.6235 1.1968 2.7171 3.0424 2.8461 1.7645 2.1233 2.1283 2.1972 1.7451 1.5761 1.4345 1.4182 1.6816 1.8151 2.0616 1.4535 1.6538 1.3929 1.4138 2.0369 1.3381 2.1134 1.1417 1.1768 1.1461 1.3040 1.4358 1.4500 3.1957 1.5557 1.9164 2.4968 1.3651 1.4558 1.6633 3.4697 2.7144 1.2235 1.2226 1.3050 2.1002 6.1781 3.4677 1.0400 2.6340 1.1005 1.0555 1.0435 1.0566 1.1340 1.0545 1.0850 1.2525 1.0930 2.7861 1.1874 2.8495 5.2717 6.1989 6.4473 5.8342 6.6034 6.2219 1.0552 1.0417 1.0374 1.0525 1.0599 1.0618 1.0613 1.0362 1.1076 1.0994 1.0990 1.1028 1.1028 1.1018 1.1020 1.0989 1.0990 1.0988 1.0916 1.1014 1.0870 1.0887 1.0871 1.0871 1.0920 1.0975 1.0874 1.0933 1.0941 1.0966
irintensity: 0.6129 0.3573 0.3311 0.1367 0.0320 0.3228 1.1301 0.1449 0.1478 1.0277 2.9262 0.3707 0.6136 0.4256 1.1278 1.2086 2.9207 2.6573 0.2192 0.5733 0.2477 0.1500 0.9885 1.6036 2.4253 0.6527 0.2397 1.3607 2.8543 6.0769 0.5556 0.9234 0.9182 5.3437 2.5944 6.8299 10.2211 27.7355 16.5476 8.2054 6.9560 0.2031 1.7985 10.8167 0.3536 5.9602 14.2660 3.3621 1.3589 4.1309 3.0426 15.0253 10.5038 0.5296 19.6389 2.7779 25.8104 50.8070 17.7701 0.7175 3.2688 1.7902 5.5827 20.6925 8.1614 65.2484 17.2603 1.6848 46.7753 1.3325 1.1308 5.7445 3.5739 65.0658 1.4691 45.0644 106.6588 0.3889 7.0472 30.6339 26.9433 1.2637 6.6681 167.0035 2.1778 4.4421 1.6338 333.9770 10.7959 124.5692 79.5729 60.0362 42.8724 34.4291 87.3382 4.0468 325.1604 0.1171 46.5043 1.6069 1.4608 50.8731 4.2906 1.6047 11.5137 38.9670 120.3915 7.3430 145.4464 3.3639 52.5437 3.0159 19.5626 28.9052 4.4485 147.0899 5.9977 32.6757 11.7621 13.8678 1.2217 0.1239 7.1639 5.7562 25.2294 16.4787 0.1690 74.2635 41.0822 13.6064 58.6110 667.8033 109.6899 2.7243 491.7093 245.8737 481.0125 28.7347 51.6375 21.8754 30.3995 46.7569 89.2164 51.2387 64.4740 39.9870 37.2362 9.4530 0.9683 2.7796 11.5227 42.7394 133.4475 37.4373 43.3625 31.7269 2.6259 35.1832 26.7741 14.5959 13.9411 8.0826 16.7424 30.0285 8.0645 37.0981 38.8854 19.9078
temp: 298.150 k
press: 1.00000 atm
elementType: 8 7 7 6 6 6 6 6 6 6 6 6 6 6 6 6 6 6 6 6 6 6 6 6 6 6 6 6 1 1 1 1 1 1 1 1 1 1 1 1 1 1 1 1 1 1 1 1 1 1 1 1 1 1 1 1 1 1
symmnumber: 1
zpe: 1280631.4 jmol-1
zpe.correction: 0.487767 hartree
zpe.thermalcorrener: 0.515760 hartree
zpe.thermalcorrenthalpy: 0.516704 hartree
zpe.thermalcorrgfe: 0.426006 hartree
zpe.sumelectzpe: -1153.331582 hartree
zpe.sumelectthermal: -1153.303588 hartree
zpe.sumelectthermalent: -1153.302644 hartree
zpe.sumelectthermalfe: -1153.393342 hartree
dipole: -3.6422 0.8549 0.1282
dipole: 3.7433
quadrupole: -104.2088 -148.1416 -175.3650
quadrupole: 10.9056 2.1098 4.8461
quadrupole: 38.3630 -5.5698 -32.7932 10.9056 2.1098 4.8461
hfenergy: -1153.8193484 hartree
pointgroup: C01 [X(C25H30N2O1)]
dipole: -1.4366075 -0.3174785 -0.0658725 debye
polarizability: 809.9459844|-9.2094516|293.9813574|4.714253|21.4858355|155.8565557 unknown
InChI: InChI=1S/C25H30N2O/c1-4-17-27(18-5-2)23-13-8-20(9-14-23)7-11-22-12-10-21-19-24(28-6-3)15-16-25(21)26-22/h7-16,19H,4-6,17-18H2,1-3H3
charge 0 multiplicity 1
58 atoms
O  8.156612 -0.327188 0.058586
N  -6.12884 -0.22902 -0.056783
N  2.520219 -0.069701 0.035501
C  -6.817035 -1.478302 -0.434417
C  -6.984487 0.92175 0.291117
C  -4.732367 -0.139502 -0.033941
C  -7.021688 -2.466468 0.742945
C  -7.276375 1.872997 -0.898319
C  -3.89931 -1.281202 -0.272383
C  -4.065463 1.10489 0.230638
C  -7.762291 -3.745857 0.299551
C  -8.177759 3.054649 -0.48103
C  -1.83338 0.058412 0.021631
C  -2.500925 -1.172818 -0.247015
C  -2.667897 1.191875 0.260141
C  -0.373993 0.096003 0.040055
C  4.731947 1.054487 0.29854
C  0.436423 1.180875 0.276246
C  1.901614 1.118747 0.277629
C  3.901735 -0.111218 0.043567
C  4.047879 2.293634 0.549042
C  2.658696 2.324727 0.538651
C  6.149578 0.931336 0.292158
C  6.751605 -0.310069 0.041047
C  4.55063 -1.36144 -0.210048
C  5.943296 -1.46815 -0.213146
C  8.841783 -1.6096 -0.196745
C  10.340016 -1.329977 -0.1110
H  -6.263805 -1.978096 -1.2528
H  -7.806568 -1.210217 -0.853476
H  -7.944448 0.52885 0.679457
H  -6.528186 1.491171 1.123649
H  -7.593223 -1.956444 1.543399
H  -6.038105 -2.725152 1.178053
H  -7.760377 1.29488 -1.709921
H  -6.320231 2.248581 -1.309132
H  -4.343814 -2.261638 -0.465357
H  -4.647937 2.014681 0.401829
H  -7.907671 -4.436682 1.149019
H  -7.195001 -4.287881 -0.480805
H  -8.760234 -3.508473 -0.116053
H  -8.385193 3.720133 -1.337837
H  -7.698541 3.663247 0.309082
H  -9.149259 2.699425 -0.087693
H  -1.896369 -2.069869 -0.431806
H  -2.21199 2.167196 0.465978
H  0.146567 -0.85227 -0.156288
H  0.003114 2.169064 0.481208
H  4.629715 3.201666 0.746052
H  2.117145 3.258392 0.72734
H  6.787042 1.801367 0.483415
H  3.91508 -2.231605 -0.400954
H  6.40798 -2.438758 -0.410197
H  8.528864 -2.355491 0.562763
H  8.561071 -1.987194 -1.20157
H  10.606735 -0.94472 0.887798
H  10.639096 -0.580403 -0.863219
H  10.911122 -2.258531 -0.293647
