program: Gaussian 09
title: 000289686
version: EM64L-G09RevD.01
frameworkgroup: C1[X(C23H22N2)]
method: RPBEPBE
basis: SDD
operation: Freq
keyword: #pfreq=noraman
keyword: PBEPBE/SDD
title: #p freq=noraman PBEPBE/SDD
converged: YES YES NO NO
title: Mulliken charges:
elementType: N N C C C C C C C C C C C C C C C C C C C C C C C H H H H H H H H H H H H H H H H H H H H H H
charge: -0.160137 -0.028586 0.054413 -0.375347 -0.375162 0.370681 0.354748 -0.420979 -0.420850 -0.553380 -0.546658 -0.641074 -0.665259 0.556949 -0.363591 -0.346938 0.401908 0.232584 -0.354915 -0.073243 -0.386687 -0.391802 -0.320669 -0.270620 -0.230474 0.211395 0.211207 0.210711 0.211990 0.208424 0.222679 0.222303 0.208233 0.218899 0.232130 0.230225 0.218951 0.230953 0.234431 0.250507 0.207673 0.223831 0.255944 0.233404 0.258390 0.224779 0.228025
chargesum: 0.00000
title: Mulliken charges with hydrogens summed into heavy atoms:
elementType: N N C C C C C C C C C C C C C C C C C C C C C C C
charge: -0.160137 -0.028586 0.054413 0.047256 0.047539 0.370681 0.354748 0.010125 0.009687 -0.102351 -0.097482 -0.410120 -0.430828 0.556949 -0.113084 -0.139265 0.401908 0.232584 -0.131084 -0.073243 -0.130743 -0.158399 -0.062279 -0.045841 -0.002449
polarizability: 5.89208558e+02 -9.72178961e+00 2.83223711e+02 -5.82538834e+00 1.50836934e+01 1.45088083e+02
1716.lowfreq: -7.8733 -3.2892 -0.0008 -0.0004 0.0005 6.0478 18.2002 27.2804 34.9448
frequency: 18.1762 27.1480 34.9018 72.3539 75.5884 97.0555 122.3947 143.6754 152.8508 179.6492 203.9926 207.7556 251.2494 281.9011 292.5001 309.0382 318.8662 374.8238 396.8959 406.1162 423.9241 437.1828 445.9979 472.8399 486.3429 493.2415 501.5482 520.2421 528.8304 536.5533 566.6162 577.4721 612.4160 617.1353 640.9576 654.1045 697.8530 735.5451 750.0443 775.4039 794.8145 806.1299 830.4131 847.5126 851.0988 864.1566 872.8245 878.5516 882.9708 885.6575 898.0989 904.7236 908.1795 919.6748 957.4119 965.1277 983.4705 989.6578 998.5853 1019.4300 1023.9475 1029.0574 1055.7462 1063.6387 1075.9285 1080.9227 1082.3676 1095.8108 1142.5079 1151.5488 1170.1773 1176.1422 1182.1931 1197.9321 1209.2509 1210.1928 1213.4030 1231.9761 1244.3942 1262.9890 1269.2197 1271.1025 1283.9237 1308.8049 1315.7452 1320.8962 1331.0107 1331.9234 1344.9809 1348.1578 1348.8038 1353.5079 1374.2521 1384.4990 1389.4148 1411.1753 1432.0311 1448.5115 1450.7069 1456.3870 1459.0592 1464.1071 1464.8864 1474.5074 1478.8476 1505.0666 1521.6364 1536.2916 1564.2838 1572.7262 1611.7389 1620.9786 1635.3070 2907.5717 2913.4082 2960.2785 2961.6229 2998.5284 2999.4312 3018.1986 3020.5943 3036.3032 3036.7936 3065.3598 3065.9221 3086.8712 3101.4907 3107.3513 3114.3043 3118.3421 3127.4916 3143.3766 3144.6473 3164.4891 3172.1655
redmass: 4.4753 4.5419 5.0642 3.2489 2.3825 4.9131 3.6189 3.6093 4.0129 4.2299 3.0099 3.7814 2.7941 4.6906 2.2244 1.8105 3.7878 3.8529 4.4205 3.2488 4.1579 3.4017 4.5328 3.3093 4.1886 3.9405 3.9933 4.2175 4.0126 3.7200 4.2017 3.3307 4.6522 3.7181 2.7015 3.3818 5.1169 3.9717 4.2786 1.3610 3.1914 5.1221 1.4105 1.6209 1.9605 1.4991 3.4364 1.8068 2.1691 1.9926 2.1259 1.5578 1.6253 2.6744 1.4343 1.3190 1.6591 1.8612 1.3593 2.4828 2.4555 2.5422 2.4942 2.5132 1.8221 2.5751 1.9529 2.4894 1.4129 1.3805 1.2621 1.4648 1.2883 1.3280 1.9070 2.0702 1.7563 1.5255 1.3548 1.4977 1.3495 1.8611 1.3381 1.9346 1.7420 1.9681 1.5332 1.6736 1.9869 1.5295 1.4234 1.8200 3.4314 2.1033 3.9396 1.9826 2.6340 2.6388 2.9362 1.4056 1.1136 1.1054 1.1240 1.0851 1.3569 3.9279 1.8952 5.7044 6.8577 6.7054 5.6213 6.1313 5.9659 1.0686 1.0709 1.0664 1.0662 1.0648 1.0638 1.0890 1.0879 1.0932 1.0929 1.1042 1.1042 1.0893 1.0907 1.0875 1.0878 1.0903 1.0857 1.0957 1.0902 1.0944 1.0986
irintensity: 0.1244 0.2863 0.0202 0.4413 0.0267 0.2299 4.9887 8.2031 0.0984 7.3119 0.2072 0.1285 0.5964 1.4736 1.2135 9.5617 1.3529 1.2960 5.8114 1.6056 21.9856 16.3865 16.5537 1.5283 1.0020 1.0523 0.9562 2.4286 2.1837 2.6237 3.6379 2.0343 10.3974 0.3983 1.8646 3.4629 1.1271 2.6270 5.4537 73.7963 3.1647 3.0227 10.4170 0.7754 0.5229 15.1413 39.4368 27.0015 4.6668 9.5214 4.9444 5.4270 8.2053 0.9888 0.1424 43.3503 29.1528 7.2150 22.9082 0.4817 4.9342 5.0514 11.6922 12.7330 1.5026 0.6135 12.3162 5.2362 0.6060 6.0590 61.9992 83.2753 66.0521 0.9717 12.1814 29.6682 1.2863 13.2777 6.0755 4.6646 17.4452 1.6918 0.2521 27.8918 168.1919 211.2760 31.4041 112.1346 110.1257 8.2884 2.1708 48.7325 8.5750 25.5928 25.6474 4.7101 39.3582 36.8035 52.2329 8.7772 3.8649 22.2080 20.0980 0.0615 104.9971 184.8697 231.5856 18.5673 196.8012 24.2510 325.1921 140.2503 9.9067 26.1533 283.2616 35.1525 35.5106 18.8942 15.5140 4.9397 156.9822 42.1509 39.1017 32.8653 75.7098 11.1508 5.6799 36.2516 37.2758 8.9786 6.5692 36.2885 14.9980 17.5956 25.3793
temp: 298.150 k
press: 1.00000 atm
elementType: 7 7 6 6 6 6 6 6 6 6 6 6 6 6 6 6 6 6 6 6 6 6 6 6 6 1 1 1 1 1 1 1 1 1 1 1 1 1 1 1 1 1 1 1 1 1 1
symmnumber: 1
zpe: 1021304.8 jmol-1
zpe.correction: 0.388994 hartree
zpe.thermalcorrener: 0.409050 hartree
zpe.thermalcorrenthalpy: 0.409995 hartree
zpe.thermalcorrgfe: 0.338944 hartree
zpe.sumelectzpe: -997.413654 hartree
zpe.sumelectthermal: -997.393598 hartree
zpe.sumelectthermalent: -997.392654 hartree
zpe.sumelectthermalfe: -997.463704 hartree
dipole: -8.7633 0.7412 0.4956
dipole: 8.8086
quadrupole: -143.6752 -129.3474 -151.4893
quadrupole: 7.2673 4.0632 0.2720
quadrupole: -2.1712 12.1566 -9.9853 7.2673 4.0632 0.2720
hfenergy: -997.8026485 hartree
pointgroup: C01 [X(C23H22N2)]
dipole: 3.4461047 -0.2476293 -0.2704908 debye
polarizability: 588.5545099|-20.6590067|148.91223|-6.230597|-24.6207327|280.0536122 unknown
InChI: InChI=1S/C23H22N2/c1-2-8-22-21(7-1)18(11-12-24-22)10-9-17-15-19-5-3-13-25-14-4-6-20(16-17)23(19)25/h1-2,7-12,15-16H,3-6,13-14H2
charge 0 multiplicity 1
47 atoms
N  5.077631 -0.207134 0.056332
N  -5.861915 0.481369 1.236797
C  3.679273 -0.093394 0.078143
C  5.806331 -0.815785 1.185298
C  5.878515 0.539705 -0.932252
C  2.911892 -0.707167 1.130618
C  2.987513 0.620741 -0.958583
C  5.000418 -1.969475 1.808746
C  5.144703 0.635728 -2.282319
C  3.620239 -1.449524 2.258325
C  3.769614 1.301811 -2.076026
C  1.513155 -0.611362 1.117172
C  1.585545 0.690175 -0.928127
C  0.803487 0.090174 0.099743
C  -0.653331 0.214665 0.053608
C  -1.552221 -0.213134 1.005425
C  -3.012126 -0.054522 0.998443
C  -3.857414 -0.012232 -0.188076
C  -3.667345 0.074671 2.243854
C  -5.268323 0.290831 -0.008547
C  -3.399848 -0.311132 -1.513796
C  -5.062856 0.340237 2.315038
C  -6.124274 0.380206 -1.153566
C  -4.263297 -0.241092 -2.611701
C  -5.63184 0.131776 -2.436058
H  6.032258 -0.055189 1.967933
H  6.776103 -1.187833 0.803457
H  6.843557 0.012626 -1.056817
H  6.110172 1.564719 -0.561384
H  5.560122 -2.386492 2.665997
H  4.878168 -2.774152 1.05965
H  5.016095 -0.381025 -2.698495
H  5.759414 1.217653 -2.99341
H  3.757683 -0.770072 3.125519
H  2.988196 -2.283947 2.613978
H  3.183228 1.278455 -3.013099
H  3.921493 2.373529 -1.829596
H  0.957745 -1.105524 1.924011
H  1.071886 1.234833 -1.732567
H  -1.040736 0.754286 -0.821212
H  -1.153435 -0.646689 1.934191
H  -3.0869 0.021451 3.171779
H  -2.369043 -0.643637 -1.662025
H  -5.546166 0.464672 3.292005
H  -7.174448 0.628628 -0.971214
H  -3.892492 -0.489569 -3.612486
H  -6.296425 0.194841 -3.304909
