program: Gaussian 09
title: 000289679
version: EM64L-G09RevD.01
frameworkgroup: C1[X(C13H10N4O)]
method: RPBEPBE
basis: SDD
operation: Freq
keyword: #p
keyword: freq=noraman
keyword: PBEPBE/SDD
title: #p freq=noraman PBEPBE/SDD
converged: NO NO NO NO
title: Mulliken charges:
elementType: O N N N N C C C C C C C C C C C C C H H H H H H H H H H
charge: -0.293096 -0.047611 -0.348040 0.047386 -0.009931 0.261941 0.058379 0.146969 -0.353465 -0.316854 -0.212047 -0.218265 0.461228 -0.373413 -0.324346 -0.301173 -0.326023 -0.329515 0.251997 0.255778 0.231772 0.230589 0.312918 0.210713 0.223793 0.276221 0.240987 0.243106
chargesum: 0.00000
title: Mulliken charges with hydrogens summed into heavy atoms:
elementType: O N N N N C C C C C C C C C C C C C
charge: -0.293096 -0.047611 -0.035122 0.047386 -0.009931 0.261941 0.058379 0.146969 -0.101468 -0.061076 0.019726 0.012325 0.461228 -0.162701 -0.100553 -0.024952 -0.085036 -0.086409
polarizability: 4.08253137e+02 9.35370664e+00 1.69222248e+02 -1.20519633e-03 2.74974452e-03 6.54465002e+01
1716.lowfreq: -3.5242 -0.6907 -0.0007 -0.0005 -0.0003 8.1460 34.9612 35.9360 39.5621
frequency: 34.8725 35.9225 39.5525 94.8506 143.2918 172.7103 211.1440 223.0305 241.3371 293.3943 320.0709 338.6756 369.5819 425.7101 444.9021 478.1298 533.3166 569.7084 574.9419 606.5201 614.7230 635.4162 651.7678 660.3416 727.5098 742.7191 744.0013 757.5612 807.7197 825.5408 846.6603 858.2189 863.5957 888.3414 925.3946 936.0343 936.2718 956.0451 967.7618 977.8849 989.2520 1002.9546 1055.9526 1064.4474 1087.8246 1091.9518 1137.6614 1163.6165 1178.2742 1212.7339 1239.5966 1249.2828 1280.3377 1298.2809 1329.2440 1352.9981 1400.3233 1404.3957 1438.2153 1457.0399 1465.1120 1519.4237 1537.6734 1579.3937 1580.6555 1591.7365 1622.1288 1660.4878 2980.1492 3122.8872 3138.0955 3139.2233 3147.6175 3156.7126 3174.3883 3174.4538 3181.2577 3399.8575
redmass: 6.2901 4.0209 6.2786 6.3876 5.9687 6.7098 2.7979 7.1165 6.2935 5.9125 5.8746 5.6150 2.5391 3.1310 6.4331 6.8166 3.0010 3.8593 8.0007 7.1987 1.2581 7.0649 10.1194 7.0495 6.6225 3.4965 3.3334 1.3982 7.2373 1.3627 7.3565 1.3712 5.8589 1.2605 1.5120 6.0114 1.3773 6.9097 1.4435 1.3017 1.4256 2.0632 2.3350 4.5647 1.8995 2.1275 2.1873 1.2962 2.9363 1.3380 2.5078 2.0686 1.5185 6.1425 1.6332 1.5145 3.8582 2.0530 3.4438 2.6538 1.9931 1.7768 6.7297 6.2376 6.1701 6.0397 7.6136 10.1854 1.0874 1.0874 1.0895 1.0863 1.0976 1.0915 1.0956 1.0966 1.0993 1.0746
irintensity: 0.1249 0.0323 0.1281 4.8617 4.3487 0.2301 28.2228 0.6687 0.4632 5.8546 4.7526 3.1327 0.0000 7.0264 5.1025 11.8797 13.8382 1.1844 1.9942 2.5943 92.8051 16.5654 1.1012 1.2220 23.8341 12.3189 2.8229 105.9587 12.5181 37.7400 22.7979 0.1580 6.2671 3.3371 42.4273 100.9741 5.8631 8.3612 5.0217 0.0292 1.2737 19.1493 8.2558 37.4115 0.4340 17.8192 173.7119 7.6705 171.7263 1.0114 22.1197 14.0068 4.3863 7.7611 5.8650 5.2035 2.4959 27.6473 34.4935 4.8024 9.5714 28.4862 67.5537 551.9946 28.4049 45.6902 5.3317 633.4667 52.1044 9.1051 25.1942 3.8426 36.1811 15.4843 11.0730 3.6051 15.2034 10.6530
temp: 298.150 k
press: 1.00000 atm
elementType: 8 7 7 7 7 6 6 6 6 6 6 6 6 6 6 6 6 6 1 1 1 1 1 1 1 1 1 1
symmnumber: 1
zpe: 544784.2 jmol-1
zpe.correction: 0.207497 hartree
zpe.thermalcorrener: 0.221526 hartree
zpe.thermalcorrenthalpy: 0.222471 hartree
zpe.thermalcorrgfe: 0.164761 hartree
zpe.sumelectzpe: -794.320949 hartree
zpe.sumelectthermal: -794.306920 hartree
zpe.sumelectthermalent: -794.305976 hartree
zpe.sumelectthermalfe: -794.363686 hartree
dipole: 2.7905 -4.0489 -0.0001
dipole: 4.9174
quadrupole: -107.4753 -90.4246 -109.1034
quadrupole: 13.1699 0.0002 0.0001
quadrupole: -5.1409 11.9098 -6.7690 13.1699 0.0002 0.0001
hfenergy: -794.5284467 hartree
pointgroup: C01 [X(C13H10N4O1)]
dipole: 1.0999209 -1.5915356 -0.0000229 debye
polarizability: 408.2284525|9.663934|169.2469325|-0.0012088|0.0027482|65.4465002 unknown
InChI: InChI=1S/C13H10N4O/c1-2-4-12-11(3-1)16-13(18-12)17-15-9-10-5-7-14-8-6-10/h1-9,17H
charge 0 multiplicity 1
28 atoms
O  2.373569 -1.507929 0.000012
N  1.64075 0.716155 0.00013
N  0.060256 -1.174763 0.000047
N  -1.097576 -0.43749 0.000033
N  -6.036341 0.990098 0.000133
C  3.520901 -0.666711 0.000044
C  3.067112 0.683915 0.000108
C  1.292133 -0.554952 0.000064
C  4.866686 -1.040568 0.000019
C  4.004765 1.735411 0.000147
C  5.800301 0.02746 0.000059
C  5.376134 1.384994 0.000122
C  -3.51493 -0.370884 0.000069
C  -2.241059 -1.09575 0.000036
C  -4.741622 -1.089438 0.000088
C  -3.582459 1.052036 0.000084
C  -5.95909 -0.374502 0.000118
C  -4.846261 1.672874 0.000115
H  5.18368 -2.08689 -0.00003
H  3.675588 2.778154 0.000196
H  6.870993 -0.202097 0.000041
H  6.131021 2.178441 0.000152
H  0.060622 -2.20574 0.000048
H  -2.288971 -2.203672 0.000057
H  -4.749941 -2.185972 0.000078
H  -2.660123 1.639787 0.000071
H  -6.917857 -0.90537 0.000132
H  -4.929586 2.765403 0.000128
