program: Gaussian 09
title: 000289669
version: EM64L-G09RevD.01
frameworkgroup: C1[X(C11H13ClN2O3)]
method: RPBEPBE
basis: SDD
operation: Freq
keyword: #p
keyword: freq=noraman
keyword: PBEPBE/SDD
title: #p freq=noraman PBEPBE/SDD
converged: YES YES NO NO
title: Mulliken charges:
elementType: Cl O O O N N C C C C C C C C C C C H H H H H H H H H H H H H
charge: -0.029755 -0.226013 -0.199548 -0.205681 -0.138496 -0.007363 0.396098 -0.390477 -0.426627 0.269932 -0.267374 -0.672400 -0.655908 -0.534427 -0.388756 0.507472 -0.209948 0.293749 0.214367 0.248203 0.242417 0.268130 0.220908 0.254984 0.233425 0.234718 0.225624 0.229761 0.319235 0.193747
chargesum: 0.00000
title: Mulliken charges with hydrogens summed into heavy atoms:
elementType: Cl O O O N N C C C C C C C C C C C
charge: -0.029755 -0.226013 -0.199548 -0.205681 -0.138496 -0.007363 0.396098 0.117639 0.063993 0.269932 0.000756 0.036918 0.034195 -0.215192 -0.388756 0.507472 -0.016201
polarizability: 2.43197922e+02 7.70986024e+00 1.91196754e+02 -1.07596083e+01 -5.96481219e+00 9.06420284e+01
1716.lowfreq: -5.2226 0.0004 0.0008 0.0010 2.3939 4.2883 42.2455 52.2647 76.4349
frequency: 42.2195 52.2085 76.3793 86.9880 98.8916 118.6402 140.6747 156.0961 178.0825 189.1611 204.8957 205.9099 213.1865 220.7202 287.0983 308.3788 324.9685 345.0367 376.8253 432.5185 445.1070 459.6292 488.2101 512.8584 568.8453 612.5021 625.0829 662.5835 685.1712 726.7313 738.0403 752.0772 793.8110 799.5951 840.6339 893.6627 924.5078 944.8361 967.2335 996.8618 1026.2271 1069.2139 1071.8294 1080.9479 1096.2643 1151.0448 1163.8585 1189.3988 1213.3458 1257.2899 1266.4434 1291.3833 1324.9837 1340.4363 1344.4959 1356.8782 1380.9550 1391.8733 1397.4952 1400.9648 1438.5715 1466.8056 1470.8034 1481.3044 1482.2120 1485.3875 1499.3906 1511.0382 1527.1768 1584.2776 1622.0149 2944.6735 2985.3774 2989.4386 2995.7324 3008.3447 3056.0718 3065.1739 3087.6589 3090.5619 3094.9172 3104.4779 3155.1805 3192.7105
redmass: 8.2387 4.3547 3.9872 5.1382 3.4938 4.8302 5.1094 4.6722 2.4506 3.1634 1.9655 1.4965 2.5344 2.8269 10.6282 5.4516 2.9166 4.3087 4.6703 3.2725 3.3055 3.5963 4.8543 4.5103 5.0465 5.4325 7.3135 6.2112 6.0930 5.3428 4.1021 6.5443 1.1374 1.2255 1.6348 2.6147 2.1077 1.4422 5.2436 1.7237 3.3563 2.6428 2.3532 1.8304 1.9280 1.9961 2.5305 4.8403 3.6792 1.2664 1.4101 1.3278 2.1822 4.3668 1.3041 2.7110 1.4899 1.7855 1.2437 1.2272 4.6956 1.0818 1.0535 1.1830 1.1096 1.1325 1.4626 2.1643 2.9450 6.6804 7.8417 1.0863 1.0647 1.0360 1.0366 1.0644 1.0968 1.0996 1.0994 1.1000 1.1017 1.0992 1.0912 1.0907
irintensity: 0.0326 0.3990 0.5477 0.9610 0.7512 3.0158 8.1851 2.1341 1.8766 2.7923 0.2250 0.6415 1.5952 3.8137 0.1229 1.4875 0.0694 7.1226 4.2516 8.7256 13.0539 10.2400 12.4180 8.3670 11.0764 0.9168 9.7856 2.0112 4.9105 2.7123 2.9012 25.3215 2.2026 11.9377 19.7313 5.1639 1.1859 5.2872 83.4316 13.9332 44.8128 9.5072 20.8653 12.0136 31.6616 11.9910 62.6645 322.2770 57.2771 23.7140 71.2099 18.2246 159.0166 64.4884 25.4560 34.6331 15.9141 5.8731 17.8645 18.2314 7.5375 13.4416 13.5611 1.1298 2.8985 5.2036 119.6523 88.2029 29.7173 669.4851 142.0920 65.2265 17.8287 20.0394 15.6011 31.7788 13.4439 2.8914 44.2562 18.2081 33.3022 33.9406 12.3072 1.3323
temp: 298.150 k
press: 1.00000 atm
elementType: 17 8 8 8 7 7 6 6 6 6 6 6 6 6 6 6 6 1 1 1 1 1 1 1 1 1 1 1 1 1
symmnumber: 1
zpe: 596048.3 jmol-1
zpe.correction: 0.227023 hartree
zpe.thermalcorrener: 0.244189 hartree
zpe.thermalcorrenthalpy: 0.245134 hartree
zpe.thermalcorrgfe: 0.181792 hartree
zpe.sumelectzpe: -1220.832098 hartree
zpe.sumelectthermal: -1220.814932 hartree
zpe.sumelectthermalent: -1220.813988 hartree
zpe.sumelectthermalfe: -1220.877330 hartree
dipole: 4.9438 7.0811 0.6559
dipole: 8.6610
quadrupole: -108.7928 -119.4095 -108.7676
quadrupole: 2.5004 5.7009 -2.3310
quadrupole: 3.5305 -7.0862 3.5557 2.5004 5.7009 -2.3310
hfenergy: -1221.0591213 hartree
pointgroup: C01[X(C11H13Cl1N2O3)]
dipole: 2.5204302 1.9567166 -1.1957519 debye
polarizability: 244.7390094|-5.1900403|142.2800052|1.2477728|-50.4595552|138.0176904 unknown
InChI: InChI=1S/C11H13ClN2O3/c1-3-13(4-2)10-6-9(12)8(7-15)5-11(10)14(16)17/h5-7H,3-4H2,1-2H3
charge 0 multiplicity 1
30 atoms
Cl -2.364262 2.238297 -2.237131
O  1.45646 -2.521695 0.602374
O  -0.103213 -2.319045 2.257653
O  -4.388253 -0.424187 0.705347
N  2.037191 0.256082 -0.366647
N  0.456459 -1.910335 1.164058
C  0.657048 0.147237 -0.36552
C  2.913402 -0.115525 0.780196
C  2.7399 0.912795 -1.50258
C  -0.118898 -0.744234 0.475872
C  -0.121131 1.020489 -1.20708
C  2.482688 0.497869 2.129531
C  3.071872 2.402391 -1.260444
C  -1.517939 -0.639893 0.569176
C  -1.510208 1.057113 -1.134099
C  -2.26209 0.258874 -0.225385
C  -3.739065 0.293326 -0.105428
H  2.983678 -1.216609 0.858732
H  3.918788 0.262196 0.525293
H  3.676822 0.349118 -1.668728
H  2.141673 0.786421 -2.42061
H  0.380052 1.720521 -1.876716
H  2.440705 1.600047 2.069295
H  1.500266 0.136247 2.4749
H  3.222182 0.218627 2.901145
H  2.160479 3.00815 -1.11561
H  3.707248 2.527793 -0.36555
H  3.624517 2.810318 -2.126024
H  -2.066502 -1.309138 1.241219
H  -4.257969 1.005747 -0.786041
